Compile problem under cmake

Trying to build your own version of Vega Strike and having problems? Unix users, paste your config.log here (stderr output alone is not helpful).

Compile problem under cmake

Postby chuck_starchaser » Fri Apr 16, 2010 12:55 pm

I installed ffmpeg and ffmpg-dbg (no ffmpeg-dev that I could see in synaptic), and ran cmake, then make, and vid_file exploded....
Code: Select all
[ 56%] Building CXX object CMakeFiles/vegastrike.dir/src/gfx/vid_file.o
In file included from /home/d/vs/repo/trunk/vegastrike/src/gfx/vid_file.cpp:8:
/home/d/vs/repo/trunk/vegastrike/src/ffmpeg_init.h:19:36: error: ffmpeg/swscale.h: No such file or directory
/home/d/vs/repo/trunk/vegastrike/src/ffmpeg_init.h:30:36: error: ffmpeg/avcodec.h: No such file or directory
/home/d/vs/repo/trunk/vegastrike/src/ffmpeg_init.h:35:37: error: ffmpeg/avformat.h: No such file or directory
/home/d/vs/repo/trunk/vegastrike/src/ffmpeg_init.h:40:33: error: ffmpeg/avio.h: No such file or directory
/home/d/vs/repo/trunk/vegastrike/src/gfx/vid_file.cpp:51: error: ISO C++ forbids declaration of ‘AVFormatContext’ with no type
/home/d/vs/repo/trunk/vegastrike/src/gfx/vid_file.cpp:51: error: expected ‘;’ before ‘*’ token
/home/d/vs/repo/trunk/vegastrike/src/gfx/vid_file.cpp:52: error: ISO C++ forbids declaration of ‘AVCodecContext’ with no type
/home/d/vs/repo/trunk/vegastrike/src/gfx/vid_file.cpp:52: error: expected ‘;’ before ‘*’ token
/home/d/vs/repo/trunk/vegastrike/src/gfx/vid_file.cpp:53: error: ISO C++ forbids declaration of ‘AVCodec’ with no type
/home/d/vs/repo/trunk/vegastrike/src/gfx/vid_file.cpp:53: error: expected ‘;’ before ‘*’ token
/home/d/vs/repo/trunk/vegastrike/src/gfx/vid_file.cpp:54: error: ISO C++ forbids declaration of ‘AVFrame’ with no type
/home/d/vs/repo/trunk/vegastrike/src/gfx/vid_file.cpp:54: error: expected ‘;’ before ‘*’ token
/home/d/vs/repo/trunk/vegastrike/src/gfx/vid_file.cpp:55: error: ISO C++ forbids declaration of ‘AVFrame’ with no type
/home/d/vs/repo/trunk/vegastrike/src/gfx/vid_file.cpp:55: error: expected ‘;’ before ‘*’ token
/home/d/vs/repo/trunk/vegastrike/src/gfx/vid_file.cpp:56: error: ISO C++ forbids declaration of ‘AVFrame’ with no type
/home/d/vs/repo/trunk/vegastrike/src/gfx/vid_file.cpp:56: error: expected ‘;’ before ‘*’ token
/home/d/vs/repo/trunk/vegastrike/src/gfx/vid_file.cpp:57: error: ISO C++ forbids declaration of ‘AVStream’ with no type
/home/d/vs/repo/trunk/vegastrike/src/gfx/vid_file.cpp:57: error: expected ‘;’ before ‘*’ token
/home/d/vs/repo/trunk/vegastrike/src/gfx/vid_file.cpp:61: error: ISO C++ forbids declaration of ‘uint8_t’ with no type
/home/d/vs/repo/trunk/vegastrike/src/gfx/vid_file.cpp:61: error: expected ‘;’ before ‘*’ token
/home/d/vs/repo/trunk/vegastrike/src/gfx/vid_file.cpp:63: error: ‘AVPacket’ does not name a type
/home/d/vs/repo/trunk/vegastrike/src/gfx/vid_file.cpp:69: error: ISO C++ forbids declaration of ‘SwsContext’ with no type
/home/d/vs/repo/trunk/vegastrike/src/gfx/vid_file.cpp:69: error: expected ‘;’ before ‘*’ token
/home/d/vs/repo/trunk/vegastrike/src/gfx/vid_file.cpp:72: error: ‘uint64_t’ does not name a type
/home/d/vs/repo/trunk/vegastrike/src/gfx/vid_file.cpp:73: error: ‘uint64_t’ does not name a type
/home/d/vs/repo/trunk/vegastrike/src/gfx/vid_file.cpp:137: error: ISO C++ forbids declaration of ‘uint8_t’ with no type
/home/d/vs/repo/trunk/vegastrike/src/gfx/vid_file.cpp:137: error: expected ‘;’ before ‘*’ token
/home/d/vs/repo/trunk/vegastrike/src/gfx/vid_file.cpp:138: error: ISO C++ forbids declaration of ‘uint8_t’ with no type
/home/d/vs/repo/trunk/vegastrike/src/gfx/vid_file.cpp:138: error: expected ‘;’ before ‘*’ token
/home/d/vs/repo/trunk/vegastrike/src/gfx/vid_file.cpp: In member function ‘void VidFileImpl::convertFrame()’:
/home/d/vs/repo/trunk/vegastrike/src/gfx/vid_file.cpp:84: error: ‘pSWSCtx’ was not declared in this scope
/home/d/vs/repo/trunk/vegastrike/src/gfx/vid_file.cpp:84: error: ‘pNextFrameYUV’ was not declared in this scope
/home/d/vs/repo/trunk/vegastrike/src/gfx/vid_file.cpp:85: error: ‘pCodecCtx’ was not declared in this scope
/home/d/vs/repo/trunk/vegastrike/src/gfx/vid_file.cpp:85: error: ‘pFrameRGB’ was not declared in this scope
/home/d/vs/repo/trunk/vegastrike/src/gfx/vid_file.cpp:85: error: ‘sws_scale’ was not declared in this scope
/home/d/vs/repo/trunk/vegastrike/src/gfx/vid_file.cpp:87: error: ‘fbPTS’ was not declared in this scope
/home/d/vs/repo/trunk/vegastrike/src/gfx/vid_file.cpp:89: error: ‘pFrameYUV’ was not declared in this scope
/home/d/vs/repo/trunk/vegastrike/src/gfx/vid_file.cpp: In member function ‘void VidFileImpl::nextFrame()’:
/home/d/vs/repo/trunk/vegastrike/src/gfx/vid_file.cpp:103: error: ‘pCodecCtx’ was not declared in this scope
/home/d/vs/repo/trunk/vegastrike/src/gfx/vid_file.cpp:103: error: ‘pNextFrameYUV’ was not declared in this scope
/home/d/vs/repo/trunk/vegastrike/src/gfx/vid_file.cpp:104: error: ‘packetBuffer’ was not declared in this scope
/home/d/vs/repo/trunk/vegastrike/src/gfx/vid_file.cpp:104: error: ‘avcodec_decode_video’ was not declared in this scope
/home/d/vs/repo/trunk/vegastrike/src/gfx/vid_file.cpp:108: warning: comparison between signed and unsigned integer expressions
/home/d/vs/repo/trunk/vegastrike/src/gfx/vid_file.cpp:115: error: ‘packet’ was not declared in this scope
/home/d/vs/repo/trunk/vegastrike/src/gfx/vid_file.cpp:124: error: ‘packet’ was not declared in this scope
/home/d/vs/repo/trunk/vegastrike/src/gfx/vid_file.cpp:125: error: ‘av_free_packet’ was not declared in this scope
/home/d/vs/repo/trunk/vegastrike/src/gfx/vid_file.cpp:127: error: ‘pFormatCtx’ was not declared in this scope
/home/d/vs/repo/trunk/vegastrike/src/gfx/vid_file.cpp:127: error: ‘packet’ was not declared in this scope
/home/d/vs/repo/trunk/vegastrike/src/gfx/vid_file.cpp:127: error: ‘av_read_frame’ was not declared in this scope
/home/d/vs/repo/trunk/vegastrike/src/gfx/vid_file.cpp:128: error: ‘packet’ was not declared in this scope
/home/d/vs/repo/trunk/vegastrike/src/gfx/vid_file.cpp:130: error: ‘packetBuffer’ was not declared in this scope
/home/d/vs/repo/trunk/vegastrike/src/gfx/vid_file.cpp: In constructor ‘VidFileImpl::VidFileImpl(size_t)’:
/home/d/vs/repo/trunk/vegastrike/src/gfx/vid_file.cpp:145: error: class ‘VidFileImpl’ does not have any field named ‘pFormatCtx’
/home/d/vs/repo/trunk/vegastrike/src/gfx/vid_file.cpp:146: error: class ‘VidFileImpl’ does not have any field named ‘pCodecCtx’
/home/d/vs/repo/trunk/vegastrike/src/gfx/vid_file.cpp:147: error: class ‘VidFileImpl’ does not have any field named ‘pCodec’
/home/d/vs/repo/trunk/vegastrike/src/gfx/vid_file.cpp:148: error: class ‘VidFileImpl’ does not have any field named ‘pStream’
/home/d/vs/repo/trunk/vegastrike/src/gfx/vid_file.cpp:149: error: class ‘VidFileImpl’ does not have any field named ‘pFrameRGB’
/home/d/vs/repo/trunk/vegastrike/src/gfx/vid_file.cpp:150: error: class ‘VidFileImpl’ does not have any field named ‘pFrameYUV’
/home/d/vs/repo/trunk/vegastrike/src/gfx/vid_file.cpp:151: error: class ‘VidFileImpl’ does not have any field named ‘pNextFrameYUV’
/home/d/vs/repo/trunk/vegastrike/src/gfx/vid_file.cpp:152: error: class ‘VidFileImpl’ does not have any field named ‘frameBuffer’
/home/d/vs/repo/trunk/vegastrike/src/gfx/vid_file.cpp:153: error: class ‘VidFileImpl’ does not have any field named ‘packetBuffer’
/home/d/vs/repo/trunk/vegastrike/src/gfx/vid_file.cpp:62: warning: ‘VidFileImpl::packetBufferSize’ will be initialized after
/home/d/vs/repo/trunk/vegastrike/src/gfx/vid_file.cpp:59: warning:   ‘bool VidFileImpl::frameReady’
/home/d/vs/repo/trunk/vegastrike/src/gfx/vid_file.cpp:144: warning:   when initialized here
/home/d/vs/repo/trunk/vegastrike/src/gfx/vid_file.cpp:158: error: ‘packet’ was not declared in this scope
/home/d/vs/repo/trunk/vegastrike/src/gfx/vid_file.cpp: In destructor ‘VidFileImpl::~VidFileImpl()’:
/home/d/vs/repo/trunk/vegastrike/src/gfx/vid_file.cpp:164: error: ‘frameBuffer’ was not declared in this scope
/home/d/vs/repo/trunk/vegastrike/src/gfx/vid_file.cpp:165: error: ‘_frameBuffer’ was not declared in this scope
/home/d/vs/repo/trunk/vegastrike/src/gfx/vid_file.cpp:166: error: ‘pFrameRGB’ was not declared in this scope
/home/d/vs/repo/trunk/vegastrike/src/gfx/vid_file.cpp:167: error: ‘av_free’ was not declared in this scope
/home/d/vs/repo/trunk/vegastrike/src/gfx/vid_file.cpp:168: error: ‘pFrameYUV’ was not declared in this scope
/home/d/vs/repo/trunk/vegastrike/src/gfx/vid_file.cpp:169: error: ‘av_free’ was not declared in this scope
/home/d/vs/repo/trunk/vegastrike/src/gfx/vid_file.cpp:170: error: ‘pNextFrameYUV’ was not declared in this scope
/home/d/vs/repo/trunk/vegastrike/src/gfx/vid_file.cpp:171: error: ‘av_free’ was not declared in this scope
/home/d/vs/repo/trunk/vegastrike/src/gfx/vid_file.cpp:173: error: ‘pSWSCtx’ was not declared in this scope
/home/d/vs/repo/trunk/vegastrike/src/gfx/vid_file.cpp:174: error: ‘sws_freeContext’ was not declared in this scope
/home/d/vs/repo/trunk/vegastrike/src/gfx/vid_file.cpp:177: error: ‘pCodecCtx’ was not declared in this scope
/home/d/vs/repo/trunk/vegastrike/src/gfx/vid_file.cpp:178: error: ‘avcodec_close’ was not declared in this scope
/home/d/vs/repo/trunk/vegastrike/src/gfx/vid_file.cpp:180: error: ‘pFormatCtx’ was not declared in this scope
/home/d/vs/repo/trunk/vegastrike/src/gfx/vid_file.cpp:181: error: ‘av_close_input_file’ was not declared in this scope
/home/d/vs/repo/trunk/vegastrike/src/gfx/vid_file.cpp: In member function ‘void VidFileImpl::open(const std::string&)’:
/home/d/vs/repo/trunk/vegastrike/src/gfx/vid_file.cpp:186: error: ‘pCodecCtx’ was not declared in this scope
/home/d/vs/repo/trunk/vegastrike/src/gfx/vid_file.cpp:193: error: ‘pFormatCtx’ was not declared in this scope
/home/d/vs/repo/trunk/vegastrike/src/gfx/vid_file.cpp:193: error: ‘av_open_input_file’ was not declared in this scope
/home/d/vs/repo/trunk/vegastrike/src/gfx/vid_file.cpp:194: error: ‘av_find_stream_info’ was not declared in this scope
/home/d/vs/repo/trunk/vegastrike/src/gfx/vid_file.cpp:201: error: ‘pCodecCtx’ was not declared in this scope
/home/d/vs/repo/trunk/vegastrike/src/gfx/vid_file.cpp:203: error: ‘pFormatCtx’ was not declared in this scope
/home/d/vs/repo/trunk/vegastrike/src/gfx/vid_file.cpp:204: error: ‘CODEC_TYPE_VIDEO’ was not declared in this scope
/home/d/vs/repo/trunk/vegastrike/src/gfx/vid_file.cpp:205: error: ‘pStream’ was not declared in this scope
/home/d/vs/repo/trunk/vegastrike/src/gfx/vid_file.cpp:208: error: ‘pCodec’ was not declared in this scope
/home/d/vs/repo/trunk/vegastrike/src/gfx/vid_file.cpp:208: error: ‘avcodec_find_decoder’ was not declared in this scope
/home/d/vs/repo/trunk/vegastrike/src/gfx/vid_file.cpp:210: error: ‘avcodec_open’ was not declared in this scope
/home/d/vs/repo/trunk/vegastrike/src/gfx/vid_file.cpp:211: error: ‘pFrameYUV’ was not declared in this scope
/home/d/vs/repo/trunk/vegastrike/src/gfx/vid_file.cpp:211: error: ‘avcodec_alloc_frame’ was not declared in this scope
/home/d/vs/repo/trunk/vegastrike/src/gfx/vid_file.cpp:212: error: ‘pNextFrameYUV’ was not declared in this scope
/home/d/vs/repo/trunk/vegastrike/src/gfx/vid_file.cpp:216: error: ‘pStream’ was not declared in this scope
/home/d/vs/repo/trunk/vegastrike/src/gfx/vid_file.cpp:225: error: ‘pFrameRGB’ was not declared in this scope
/home/d/vs/repo/trunk/vegastrike/src/gfx/vid_file.cpp:227: error: ‘PIX_FMT_RGB24’ was not declared in this scope
/home/d/vs/repo/trunk/vegastrike/src/gfx/vid_file.cpp:227: error: ‘avpicture_get_size’ was not declared in this scope
/home/d/vs/repo/trunk/vegastrike/src/gfx/vid_file.cpp:228: error: ‘_frameBuffer’ was not declared in this scope
/home/d/vs/repo/trunk/vegastrike/src/gfx/vid_file.cpp:228: error: expected type-specifier before ‘uint8_t’
/home/d/vs/repo/trunk/vegastrike/src/gfx/vid_file.cpp:228: error: expected ‘;’ before ‘uint8_t’
/home/d/vs/repo/trunk/vegastrike/src/gfx/vid_file.cpp:230: error: ‘AVPicture’ was not declared in this scope
/home/d/vs/repo/trunk/vegastrike/src/gfx/vid_file.cpp:230: error: expected primary-expression before ‘)’ token
/home/d/vs/repo/trunk/vegastrike/src/gfx/vid_file.cpp:230: error: ‘avpicture_fill’ was not declared in this scope
/home/d/vs/repo/trunk/vegastrike/src/gfx/vid_file.cpp:231: error: ‘frameBuffer’ was not declared in this scope
/home/d/vs/repo/trunk/vegastrike/src/gfx/vid_file.cpp:236: error: ‘fbPTS’ was not declared in this scope
/home/d/vs/repo/trunk/vegastrike/src/gfx/vid_file.cpp:239: error: ‘pSWSCtx’ was not declared in this scope
/home/d/vs/repo/trunk/vegastrike/src/gfx/vid_file.cpp:240: error: ‘SWS_LANCZOS’ was not declared in this scope
/home/d/vs/repo/trunk/vegastrike/src/gfx/vid_file.cpp:240: error: ‘sws_getContext’ was not declared in this scope
/home/d/vs/repo/trunk/vegastrike/src/gfx/vid_file.cpp: In member function ‘bool VidFileImpl::seek(float)’:
/home/d/vs/repo/trunk/vegastrike/src/gfx/vid_file.cpp:247: error: ‘pCodecCtx’ was not declared in this scope
/home/d/vs/repo/trunk/vegastrike/src/gfx/vid_file.cpp:248: error: ‘fbPTS’ was not declared in this scope
/home/d/vs/repo/trunk/vegastrike/src/gfx/vid_file.cpp:248: error: ‘pNextFrameYUV’ was not declared in this scope
/home/d/vs/repo/trunk/vegastrike/src/gfx/vid_file.cpp:254: error: ‘pFormatCtx’ was not declared in this scope
/home/d/vs/repo/trunk/vegastrike/src/gfx/vid_file.cpp:254: error: ‘AVSEEK_FLAG_BACKWARD’ was not declared in this scope
/home/d/vs/repo/trunk/vegastrike/src/gfx/vid_file.cpp:254: error: ‘av_seek_frame’ was not declared in this scope
/home/d/vs/repo/trunk/vegastrike/src/gfx/vid_file.cpp:265: error: ‘sizePTS’ was not declared in this scope
/home/d/vs/repo/trunk/vegastrike/src/gfx/vid_file.cpp: In member function ‘void* VidFile::getFrameBuffer() const’:
/home/d/vs/repo/trunk/vegastrike/src/gfx/vid_file.cpp:349: error: ‘class VidFileImpl’ has no member named ‘frameBuffer’
make[2]: *** [CMakeFiles/vegastrike.dir/src/gfx/vid_file.o] Error 1
make[1]: *** [CMakeFiles/vegastrike.dir/all] Error 2
make: *** [all] Error 2
User avatar
chuck_starchaser
Elite
Elite
 
Posts: 8014
Topics: 195
Joined: Thu Sep 04, 2003 9:03 pm
Location: Montreal

Share On:

Share on Facebook Facebook Share on Twitter Twitter Share on Digg Digg

Re: Compile problem under cmake

Postby CLoneWolf » Fri Apr 16, 2010 1:33 pm

Checking the Seeeearch engine for ubuntu ffmpeg +"avcodec.h" I found this wiki page about VLC where the relevant packages are mentioned; but since that information may be outdated, here's what to do when you lack a file with a known name and unknown package: go to http://packages.ubuntu.com/ scroll down to "Search the contents of packages", set your distro, type the file name and search.

avcodec.h for instance is reported as available in libavcodec-dev and libmyth-dev

Rinse and repeat for the other missing files.

HTH!
CLoneWolf
ISO Party Member
ISO Party Member
 
Posts: 442
Topics: 9
Joined: Thu May 01, 2008 10:14 am

Re: Compile problem under cmake

Postby chuck_starchaser » Fri Apr 16, 2010 1:41 pm

CLoneWolf wrote:Checking the Seeeearch engine for ubuntu ffmpeg +"avcodec.h" I found this wiki page about VLC where the relevant packages are mentioned; but since that information may be outdated, here's what to do when you lack a file with a known name and unknown package: go to http://packages.ubuntu.com/ scroll down to "Search the contents of packages", set your distro, type the file name and search.
Thanks! I'll do so.

avcodec.h for instance is reported as available in libavcodec-dev and libmyth-dev

This is funny, because I DO have libavcodec52 and libavcodec52-dev.
There are no packages without the "52" in them, in Synaptic; not sure what that means...
There's also a libavcodec52-extras or something, but to install it wants to uninstall other packages I have installed...
User avatar
chuck_starchaser
Elite
Elite
 
Posts: 8014
Topics: 195
Joined: Thu Sep 04, 2003 9:03 pm
Location: Montreal

Re: Compile problem under cmake

Postby CLoneWolf » Fri Apr 16, 2010 1:48 pm

VERY weird! Searching for libavcodec in the "Search package directories" gives this and the -dev package name has no number from Dapper to Lucid! :shock: (Same on my Debian unstable, for the record)
CLoneWolf
ISO Party Member
ISO Party Member
 
Posts: 442
Topics: 9
Joined: Thu May 01, 2008 10:14 am

Re: Compile problem under cmake

Postby chuck_starchaser » Fri Apr 16, 2010 2:14 pm

Weird indeed!
Even aptitude doesn't find libavcodec.
Code: Select all
$ sudo aptitude install libavcodec
Reading package lists... Done
Building dependency tree       
Reading state information... Done
Reading extended state information     
Initializing package states... Done
Couldn't find package "libavcodec".  However, the following
packages contain "libavcodec" in their name:
  libavcodec-dev libavcodec52 libavcodec-unstripped-52 libavcodec-extra-52
Couldn't find package "libavcodec".  However, the following
packages contain "libavcodec" in their name:
  libavcodec-dev libavcodec52 libavcodec-unstripped-52 libavcodec-extra-52
No packages will be installed, upgraded, or removed.
0 packages upgraded, 0 newly installed, 0 to remove and 1 not upgraded.
Need to get 0B of archives. After unpacking 0B will be used.
Reading package lists... Done
Building dependency tree       
Reading state information... Done
Reading extended state information     
Initializing package states... Done

But you're right about the -dev package having no number; and in fact I DO have libavcodec-dev installed; but not libavcodec.
By the way, I have Karmic.
User avatar
chuck_starchaser
Elite
Elite
 
Posts: 8014
Topics: 195
Joined: Thu Sep 04, 2003 9:03 pm
Location: Montreal

Re: Compile problem under cmake

Postby chuck_starchaser » Fri Apr 16, 2010 2:43 pm

swscale.h -- contained in libswscale-dev

Trying to install libswscale-dev:
Code: Select all
$ sudo aptitude install libswscale-dev
Reading package lists... Done
Building dependency tree       
Reading state information... Done
Reading extended state information     
Initializing package states... Done
No packages will be installed, upgraded, or removed.
0 packages upgraded, 0 newly installed, 0 to remove and 1 not upgraded.
Need to get 0B of archives. After unpacking 0B will be used.
Writing extended state information... Done
Reading package lists... Done             
Building dependency tree       
Reading state information... Done
Reading extended state information     
Initializing package states... Done



avformat.h -- contained in libavformat-dev

Trying to install libavformat:
Code: Select all
$ sudo aptitude install libavformat-dev
Reading package lists... Done
Building dependency tree       
Reading state information... Done
Reading extended state information     
Initializing package states... Done
No packages will be installed, upgraded, or removed.
0 packages upgraded, 0 newly installed, 0 to remove and 1 not upgraded.
Need to get 0B of archives. After unpacking 0B will be used.
Writing extended state information... Done
Reading package lists... Done             
Building dependency tree       
Reading state information... Done
Reading extended state information     
Initializing package states... Done



avio.h -- contained in libavformat-dev, which just refused to install (or I already have it; not sure).
User avatar
chuck_starchaser
Elite
Elite
 
Posts: 8014
Topics: 195
Joined: Thu Sep 04, 2003 9:03 pm
Location: Montreal

Re: Compile problem under cmake

Postby klauss » Fri Apr 16, 2010 3:09 pm

Remember to delete CMakeCache between tests.

If it doesn't work anyways, paste CMakeCache to see what it detects.
Oíd mortales, el grito sagrado...
Call me "Menes, lord of Cats"
Wing Commander Universe
User avatar
klauss
Elite
Elite
 
Posts: 7243
Topics: 55
Joined: Mon Apr 18, 2005 7:40 am
Location: LS87, Buenos Aires, República Argentina

Re: Compile problem under cmake

Postby chuck_starchaser » Fri Apr 16, 2010 3:58 pm

Didn't know about this cache. Deleted it, but same problem:
Code: Select all
[ 78%] Building CXX object CMakeFiles/vegastrike.dir/src/gfx/vid_file.o
In file included from /home/d/vs/repo/trunk/vegastrike/src/gfx/vid_file.cpp:8:
/home/d/vs/repo/trunk/vegastrike/src/ffmpeg_init.h:19:36: error: ffmpeg/swscale.h: No such file or directory
/home/d/vs/repo/trunk/vegastrike/src/ffmpeg_init.h:30:36: error: ffmpeg/avcodec.h: No such file or directory
/home/d/vs/repo/trunk/vegastrike/src/ffmpeg_init.h:35:37: error: ffmpeg/avformat.h: No such file or directory
/home/d/vs/repo/trunk/vegastrike/src/ffmpeg_init.h:40:33: error: ffmpeg/avio.h: No such file or directory

Here's CMakeCache.txt:
Code: Select all
# This is the CMakeCache file.

########################
# EXTERNAL cache entries
########################

AVCODEC_FOUND:BOOL=TRUE

//Path to a file.
AVCODEC_INCLUDE_DIR:PATH=/usr/include/libavcodec

//Path to a library.
AVCODEC_LIBRARY:FILEPATH=/usr/lib/libavcodec.so

AVFORMAT_FOUND:BOOL=TRUE

//Path to a file.
AVFORMAT_INCLUDE_DIR:PATH=/usr/include/libavformat

//Path to a library.
AVFORMAT_LIBRARY:FILEPATH=/usr/lib/libavformat.so

AVUTIL_FOUND:BOOL=TRUE

//Path to a file.
AVUTIL_INCLUDE_DIR:PATH=/usr/include/libavutil

//Path to a library.
AVUTIL_LIBRARY:FILEPATH=/usr/lib/libavutil.so

//Path to a file.
Boost_INCLUDE_DIR:PATH=/usr/include

//Boost library directory
Boost_LIBRARY_DIRS:FILEPATH=/usr/lib

//The Boost PYTHON library
Boost_PYTHON_LIBRARY:FILEPATH=/usr/lib/libboost_python.so

//Path to a library.
Boost_PYTHON_LIBRARY_DEBUG:FILEPATH=Boost_PYTHON_LIBRARY_DEBUG-NOTFOUND

//Path to a library.
Boost_PYTHON_LIBRARY_RELEASE:FILEPATH=/usr/lib/libboost_python.so

//Path to a program.
CMAKE_AR:FILEPATH=/usr/bin/ar

//For backwards compatibility, what version of CMake commands and
// syntax should this version of CMake try to support.
CMAKE_BACKWARDS_COMPATIBILITY:STRING=2.4

//Debug, Release, RelWithDebInfo, Maintainer, Profiler
CMAKE_BUILD_TYPE:STRING=Release

//Enable/Disable color output during build.
CMAKE_COLOR_MAKEFILE:BOOL=ON

//CXX compiler.
CMAKE_CXX_COMPILER:FILEPATH=/usr/bin/c++

//Flags used by the compiler during all build types.
CMAKE_CXX_FLAGS:STRING=

//Flags used by the C++ compiler during debug builds.
CMAKE_CXX_FLAGS_DEBUG:STRING=  -DNV_CUBE_MAP -DBOOST_PYTHON_NO_PY_SIGNATURES -include config.h -pipe -g2 -Wall -O0 -fvisibility=hidden

//Flags used by the C++ compiler during maintainer builds.
CMAKE_CXX_FLAGS_MAINTAINER:STRING= -DNV_CUBE_MAP -DBOOST_PYTHON_NO_PY_SIGNATURES -include config.h -pipe -g2 -Wall -Wno-unused-function -Wno-unused-variable -O0 -fvisibility=hidden

//Flags used by the compiler during release minsize builds.
CMAKE_CXX_FLAGS_MINSIZEREL:STRING=-Os -DNDEBUG

//Flags used by the C++ compiler during profiler builds.
CMAKE_CXX_FLAGS_PROFILER:STRING=  -O2 -pg -g2 -DNV_CUBE_MAP -DBOOST_PYTHON_NO_PY_SIGNATURES -include config.h -pipe -Wall -Wno-unused-function -Wno-unused-variable -O3

//Flags used by the C++ compiler during release builds.
CMAKE_CXX_FLAGS_RELEASE:STRING= -DNV_CUBE_MAP -DBOOST_PYTHON_NO_PY_SIGNATURES -include config.h -pipe -O2 -Wall -fvisibility=hidden

//Flags used by the C++ compiler during release builds.
CMAKE_CXX_FLAGS_RELWITHDEBINFO:STRING=    -DNV_CUBE_MAP -DBOOST_PYTHON_NO_PY_SIGNATURES -include config.h -pipe -O2 -Wall -Wno-unused-function -Wno-unused-variable -fvisibility=hidden

//C compiler.
CMAKE_C_COMPILER:FILEPATH=/usr/bin/gcc

//Flags used by the compiler during all build types.
CMAKE_C_FLAGS:STRING=

//Flags used by the C compiler during debug builds.
CMAKE_C_FLAGS_DEBUG:STRING=   -DNV_CUBE_MAP -DBOOST_PYTHON_NO_PY_SIGNATURES -include config.h -pipe -g2 -Wall -Wno-unused-function -Wno-unused-variable -O0 -fvisibility=hidden

//Flags used by the C compiler during maintainer builds.
CMAKE_C_FLAGS_MAINTAINER:STRING= -DNV_CUBE_MAP -DBOOST_PYTHON_NO_PY_SIGNATURES -include config.h -pipe -g2 -Wall -Wno-unused-function -Wno-unused-variable -O0 -fvisibility=hidden

//Flags used by the compiler during release minsize builds.
CMAKE_C_FLAGS_MINSIZEREL:STRING=-Os -DNDEBUG

//Flags used by the C compiler during profiler builds.
CMAKE_C_FLAGS_PROFILER:STRING=  -O2 -pg -g2 -DNV_CUBE_MAP -DBOOST_PYTHON_NO_PY_SIGNATURES -include config.h -pipe -Wall -Wno-unused-function -Wno-unused-variable -O3

//Flags used by the C compiler during release builds.
CMAKE_C_FLAGS_RELEASE:STRING=  -DNV_CUBE_MAP -DBOOST_PYTHON_NO_PY_SIGNATURES -include config.h -pipe -O2 -Wall -Wno-unused-function -Wno-unused-variable -fvisibility=hidden

//Flags used by the C compiler during release builds.
CMAKE_C_FLAGS_RELWITHDEBINFO:STRING=    -DNV_CUBE_MAP -DBOOST_PYTHON_NO_PY_SIGNATURES -include config.h -pipe -O2 -Wall -Wno-unused-function -Wno-unused-variable -fvisibility=hidden

//Flags used by the linker.
CMAKE_EXE_LINKER_FLAGS:STRING=

//Flags used by the linker during debug builds.
CMAKE_EXE_LINKER_FLAGS_DEBUG:STRING=

//Flags used for linking binaries during maintainer builds.
CMAKE_EXE_LINKER_FLAGS_MAINTAINER:STRING=

//Flags used by the linker during release minsize builds.
CMAKE_EXE_LINKER_FLAGS_MINSIZEREL:STRING=

//Flags used for linking binaries during profiler builds.
CMAKE_EXE_LINKER_FLAGS_PROFILER:STRING='-Bsymbolic '

//Release linker flags
CMAKE_EXE_LINKER_FLAGS_RELEASE:STRING=-Bsymbolic

//Flags used by the linker during Release with Debug Info builds.
CMAKE_EXE_LINKER_FLAGS_RELWITHDEBINFO:STRING=

//Install path prefix, prepended onto install directories.
CMAKE_INSTALL_PREFIX:PATH=/usr/local

//Path to a program.
CMAKE_LINKER:FILEPATH=/usr/bin/ld

//Path to a program.
CMAKE_MAKE_PROGRAM:FILEPATH=/usr/bin/make

//Flags used by the linker during the creation of modules.
CMAKE_MODULE_LINKER_FLAGS:STRING=

//Flags used by the linker during debug builds.
CMAKE_MODULE_LINKER_FLAGS_DEBUG:STRING=

//Flags used by the linker during release minsize builds.
CMAKE_MODULE_LINKER_FLAGS_MINSIZEREL:STRING=

//Flags used by the linker during release builds.
CMAKE_MODULE_LINKER_FLAGS_RELEASE:STRING=

//Flags used by the linker during Release with Debug Info builds.
CMAKE_MODULE_LINKER_FLAGS_RELWITHDEBINFO:STRING=

//Path to a program.
CMAKE_NM:FILEPATH=/usr/bin/nm

//Path to a program.
CMAKE_OBJCOPY:FILEPATH=/usr/bin/objcopy

//Path to a program.
CMAKE_OBJDUMP:FILEPATH=/usr/bin/objdump

//Path to a program.
CMAKE_RANLIB:FILEPATH=/usr/bin/ranlib

//Flags used by the linker during the creation of dll's.
CMAKE_SHARED_LINKER_FLAGS:STRING=

//Flags used by the linker during debug builds.
CMAKE_SHARED_LINKER_FLAGS_DEBUG:STRING=

//Flags used by the shared libraries linker during maintainer builds.
CMAKE_SHARED_LINKER_FLAGS_MAINTAINER:STRING=

//Flags used by the linker during release minsize builds.
CMAKE_SHARED_LINKER_FLAGS_MINSIZEREL:STRING=

//Flags used by the linker during release builds.
CMAKE_SHARED_LINKER_FLAGS_RELEASE:STRING=

//Flags used by the linker during Release with Debug Info builds.
CMAKE_SHARED_LINKER_FLAGS_RELWITHDEBINFO:STRING=

//If set, runtime paths are not added when using shared libraries.
CMAKE_SKIP_RPATH:BOOL=NO

//Path to a program.
CMAKE_STRIP:FILEPATH=/usr/bin/strip

//If true, cmake will use relative paths in makefiles and projects.
CMAKE_USE_RELATIVE_PATHS:BOOL=OFF

//If this value is on, makefiles will be generated without the
// .SILENT directive, and all commands will be echoed to the console
// during the make.  This is useful for debugging only. With Visual
// Studio IDE projects all commands are done without /nologo.
CMAKE_VERBOSE_MAKEFILE:BOOL=FALSE

//Enable AMD K10 optimizations (Athlon2)
CPUAMD_k10:BOOL=OFF

//Enable AMD K8 optimizations (Athlon through athlon64)
CPUAMD_k8:BOOL=OFF

//Enable AMD K9 (sse3) optimizations (Athlon64 AM3)
CPUAMD_k9:BOOL=OFF

//Enable Intel Core2 optimizations
CPUINTEL_core2:BOOL=OFF

//Enable Intel P4 (64bit) optimizations
CPUINTEL_nocona:BOOL=OFF

//Enable Intel P4 optimizations (1st gen P4's)
CPUINTEL_p4:BOOL=OFF

//Enable Intel P4 (sse3) optimizations
CPUINTEL_prescott:BOOL=OFF

//Number of CPU's in system
CPU_SMP:STRING=1

//Disable building the vegastrike bin
DISABLE_CLIENT:BOOL=OFF

//Path to a library.
DL_LIB:FILEPATH=/usr/lib/libdl.so

//Single output directory for building all executables.
EXECUTABLE_OUTPUT_PATH:PATH=

//Path to a file.
EXPAT_INCLUDE_DIR:PATH=/usr/include

//Path to a library.
EXPAT_LIBRARY:FILEPATH=/usr/lib/libexpat.so

FFMPEG_DEFINITIONS:STRING=

FFMPEG_INCLUDE_DIRS:STRING=/usr/include/libavcodec;/usr/include/libavformat;/usr/include/libavutil;/usr/include/libswscale

FFMPEG_LIBRARIES:STRING=/usr/lib/libavcodec.so;/usr/lib/libavformat.so;/usr/lib/libavutil.so;/usr/lib/libswscale.so

//Path to a file.
GLUT_INCLUDE_DIR:PATH=/usr/include

//Path to a library.
GLUT_Xi_LIBRARY:FILEPATH=/usr/lib/libXi.so

//Path to a library.
GLUT_Xmu_LIBRARY:FILEPATH=/usr/lib/libXmu.so

//Path to a library.
GLUT_glut_LIBRARY:FILEPATH=/usr/lib/libglut.so

//Path to a file.
GTK2_ATK_INCLUDE_DIR:PATH=/usr/include/atk-1.0

//Path to a library.
GTK2_ATK_LIBRARY:FILEPATH=/usr/lib/libatk-1.0.so

//Path to a file.
GTK2_CAIRO_INCLUDE_DIR:PATH=/usr/include/cairo

//Path to a library.
GTK2_CAIRO_LIBRARY:FILEPATH=/usr/lib/libpangocairo-1.0.so

//Path to a file.
GTK2_GDK_INCLUDE_DIR:PATH=/usr/lib/gtk-2.0/include

//Path to a library.
GTK2_GDK_LIBRARY:FILEPATH=/usr/lib/libgdk-x11-2.0.so

//Path to a library.
GTK2_GDK_PIXBUF_LIBRARY:FILEPATH=/usr/lib/libgdk_pixbuf-2.0.so

//Path to a file.
GTK2_GLIBCONFIG_INCLUDE_DIR:PATH=/usr/lib/glib-2.0/include

//Path to a file.
GTK2_GLIB_INCLUDE_DIR:PATH=/usr/include/glib-2.0

//Path to a library.
GTK2_GLIB_LIBRARY:FILEPATH=/usr/lib/libglib-2.0.so

//Path to a library.
GTK2_GMODULE_LIBRARY:FILEPATH=/usr/lib/libgmodule-2.0.so

//Path to a library.
GTK2_GOBJECT_LIBRARY:FILEPATH=/usr/lib/libgobject-2.0.so

//Path to a library.
GTK2_GTHREAD_LIBRARY:FILEPATH=/usr/lib/libgthread-2.0.so

//Path to a file.
GTK2_GTKGL_INCLUDE_DIR:PATH=GTK2_GTKGL_INCLUDE_DIR-NOTFOUND

//Path to a library.
GTK2_GTKGL_LIBRARY:FILEPATH=GTK2_GTKGL_LIBRARY-NOTFOUND

//Path to a file.
GTK2_GTK_INCLUDE_DIR:PATH=/usr/include/gtk-2.0

//Path to a library.
GTK2_GTK_LIBRARY:FILEPATH=/usr/lib/libgtk-x11-2.0.so

//Path to a file.
GTK2_PANGO_INCLUDE_DIR:PATH=/usr/include/pango-1.0

//Path to a library.
GTK2_PANGO_LIBRARY:FILEPATH=/usr/lib/libpango-1.0.so

HAVE_AVCODEC_H:BOOL=1

HAVE_AVFORMAT_H:BOOL=1

HAVE_AVIO_H:BOOL=1

HAVE_FFMPEG_SWSCALE_H:BOOL=1

//Path to a file.
JPEG_INCLUDE_DIR:PATH=/usr/include

//Path to a library.
JPEG_LIBRARY:FILEPATH=/usr/lib/libjpeg.so

//Single output directory for building all libraries.
LIBRARY_OUTPUT_PATH:PATH=

//Path to a file.
MATH_INCLUDE_DIRS:PATH=/usr/include

//Path to a library.
MATH_LIBRARIES:FILEPATH=/usr/lib/libm.so

//Path to a file.
OPENAL_INCLUDE_DIR:PATH=/usr/include/AL

//Path to a library.
OPENAL_LIBRARY:FILEPATH=/usr/lib/libopenal.so

//Path to a file.
OPENGL_INCLUDE_DIR:PATH=/usr/include

//Path to a library.
OPENGL_gl_LIBRARY:FILEPATH=/usr/lib/libGL.so

//Path to a library.
OPENGL_glu_LIBRARY:FILEPATH=/usr/lib/libGLU.so

//Path to a file.
OPENGL_xmesa_INCLUDE_DIR:PATH=OPENGL_xmesa_INCLUDE_DIR-NOTFOUND

//Dependencies for target
OPcollide_LIB_DEPENDS:STATIC=

//pkg-config executable
PKG_CONFIG_EXECUTABLE:FILEPATH=/usr/bin/pkg-config

//Path to a file.
PNG_INCLUDE_DIRS:PATH=/usr/include

//Path to a library.
PNG_LIBRARIES:FILEPATH=/usr/lib/libpng.so

//Path to a file.
PYTHON_INCLUDE_PATH:PATH=/usr/include/python2.6

//Path to a library.
PYTHON_LIBRARY:FILEPATH=/usr/lib/python2.6/config/libpython2.6.so

//Path to a library.
SDLMAIN_LIBRARY:FILEPATH=/usr/lib/libSDLmain.a

//Path to a file.
SDL_INCLUDE_DIR:PATH=/usr/include/SDL

//Where the SDL Library can be found
SDL_LIBRARY:STRING=/usr/lib/libSDLmain.a;/usr/lib/libSDL.so;-lpthread

//Path to a file.
SWSCALE_INCLUDE_DIR:PATH=/usr/include/libswscale

//Path to a library.
SWSCALE_LIBRARY:FILEPATH=/usr/lib/libswscale.so

//Enable Posix net threads
USE_NET_THREAD_POSIX:BOOL=OFF

//Path to a library.
UTIL_LIB:FILEPATH=/usr/lib/libutil.so

//Path to a file.
X11_ICE_INCLUDE_PATH:PATH=/usr/include

//Path to a library.
X11_ICE_LIB:FILEPATH=/usr/lib/libICE.so

//Path to a library.
X11_SM_LIB:FILEPATH=/usr/lib/libSM.so

//Path to a file.
X11_X11_INCLUDE_PATH:PATH=/usr/include

//Path to a library.
X11_X11_LIB:FILEPATH=/usr/lib/libX11.so

//Path to a file.
X11_XShm_INCLUDE_PATH:PATH=/usr/include

//Path to a file.
X11_XTest_INCLUDE_PATH:PATH=/usr/include

//Path to a library.
X11_XTest_LIB:FILEPATH=X11_XTest_LIB-NOTFOUND

//Path to a file.
X11_Xaccessrules_INCLUDE_PATH:PATH=X11_Xaccessrules_INCLUDE_PATH-NOTFOUND

//Path to a file.
X11_Xaccessstr_INCLUDE_PATH:PATH=/usr/include

//Path to a file.
X11_Xau_INCLUDE_PATH:PATH=/usr/include

//Path to a library.
X11_Xau_LIB:FILEPATH=/usr/lib/libXau.so

//Path to a file.
X11_Xcomposite_INCLUDE_PATH:PATH=/usr/include

//Path to a library.
X11_Xcomposite_LIB:FILEPATH=/usr/lib/libXcomposite.so

//Path to a file.
X11_Xcursor_INCLUDE_PATH:PATH=/usr/include

//Path to a library.
X11_Xcursor_LIB:FILEPATH=/usr/lib/libXcursor.so

//Path to a file.
X11_Xdamage_INCLUDE_PATH:PATH=/usr/include

//Path to a library.
X11_Xdamage_LIB:FILEPATH=/usr/lib/libXdamage.so

//Path to a file.
X11_Xdmcp_INCLUDE_PATH:PATH=/usr/include

//Path to a library.
X11_Xdmcp_LIB:FILEPATH=/usr/lib/libXdmcp.so

//Path to a library.
X11_Xext_LIB:FILEPATH=/usr/lib/libXext.so

//Path to a file.
X11_Xfixes_INCLUDE_PATH:PATH=/usr/include

//Path to a library.
X11_Xfixes_LIB:FILEPATH=/usr/lib/libXfixes.so

//Path to a file.
X11_Xft_INCLUDE_PATH:PATH=/usr/include

//Path to a library.
X11_Xft_LIB:FILEPATH=/usr/lib/libXft.so

//Path to a file.
X11_Xinerama_INCLUDE_PATH:PATH=/usr/include

//Path to a library.
X11_Xinerama_LIB:FILEPATH=/usr/lib/libXinerama.so

//Path to a file.
X11_Xinput_INCLUDE_PATH:PATH=/usr/include

//Path to a library.
X11_Xinput_LIB:FILEPATH=/usr/lib/libXi.so

//Path to a file.
X11_Xkb_INCLUDE_PATH:PATH=/usr/include

//Path to a file.
X11_Xkblib_INCLUDE_PATH:PATH=/usr/include

//Path to a file.
X11_Xlib_INCLUDE_PATH:PATH=/usr/include

//Path to a file.
X11_Xpm_INCLUDE_PATH:PATH=X11_Xpm_INCLUDE_PATH-NOTFOUND

//Path to a library.
X11_Xpm_LIB:FILEPATH=X11_Xpm_LIB-NOTFOUND

//Path to a file.
X11_Xrandr_INCLUDE_PATH:PATH=/usr/include

//Path to a library.
X11_Xrandr_LIB:FILEPATH=/usr/lib/libXrandr.so

//Path to a file.
X11_Xrender_INCLUDE_PATH:PATH=/usr/include

//Path to a library.
X11_Xrender_LIB:FILEPATH=/usr/lib/libXrender.so

//Path to a file.
X11_Xscreensaver_INCLUDE_PATH:PATH=X11_Xscreensaver_INCLUDE_PATH-NOTFOUND

//Path to a library.
X11_Xscreensaver_LIB:FILEPATH=X11_Xscreensaver_LIB-NOTFOUND

//Path to a file.
X11_Xshape_INCLUDE_PATH:PATH=/usr/include

//Path to a file.
X11_Xt_INCLUDE_PATH:PATH=/usr/include

//Path to a library.
X11_Xt_LIB:FILEPATH=/usr/lib/libXt.so

//Path to a file.
X11_Xutil_INCLUDE_PATH:PATH=/usr/include

//Path to a file.
X11_Xv_INCLUDE_PATH:PATH=X11_Xv_INCLUDE_PATH-NOTFOUND

//Path to a library.
X11_Xv_LIB:FILEPATH=X11_Xv_LIB-NOTFOUND

//Path to a library.
X11_Xxf86misc_LIB:FILEPATH=X11_Xxf86misc_LIB-NOTFOUND

//Path to a file.
X11_dpms_INCLUDE_PATH:PATH=/usr/include

//Path to a file.
X11_xf86misc_INCLUDE_PATH:PATH=X11_xf86misc_INCLUDE_PATH-NOTFOUND

//Path to a file.
X11_xf86vmode_INCLUDE_PATH:PATH=X11_xf86vmode_INCLUDE_PATH-NOTFOUND

//Path to a file.
ZLIB_INCLUDE_DIR:PATH=/usr/include

//Path to a library.
ZLIB_LIBRARY:FILEPATH=/usr/lib/libz.so

//Dependencies for target
engine_com_LIB_DEPENDS:STATIC=

//Dependencies for target
netgeneric_LIB_DEPENDS:STATIC=

//Dependencies for target
netlowlevel_LIB_DEPENDS:STATIC=

//Path to a file.
ogg_INCLUDE_DIR:PATH=/usr/include/ogg

//Path to a library.
ogg_LIBRARY:FILEPATH=/usr/lib/libogg.so

//Path to a file.
vorbis_INCLUDE_DIR:PATH=/usr/include/vorbis

//Path to a library.
vorbis_LIBRARY:FILEPATH=/usr/lib/libvorbis.so

//Path to a library.
vorbisfile_LIBRARY:FILEPATH=/usr/lib/libvorbisfile.so

//Value Computed by CMake
vsUTCS_BINARY_DIR:STATIC=/home/d/vs/cmake/vegastrike

//Value Computed by CMake
vsUTCS_SOURCE_DIR:STATIC=/home/d/vs/repo/trunk/vegastrike


########################
# INTERNAL cache entries
########################

//Advanced flag for variable: AVCODEC_FOUND
AVCODEC_FOUND-ADVANCED:INTERNAL=1
//Advanced flag for variable: AVCODEC_INCLUDE_DIR
AVCODEC_INCLUDE_DIR-ADVANCED:INTERNAL=1
//Advanced flag for variable: AVCODEC_LIBRARY
AVCODEC_LIBRARY-ADVANCED:INTERNAL=1
//Advanced flag for variable: AVFORMAT_FOUND
AVFORMAT_FOUND-ADVANCED:INTERNAL=1
//Advanced flag for variable: AVFORMAT_INCLUDE_DIR
AVFORMAT_INCLUDE_DIR-ADVANCED:INTERNAL=1
//Advanced flag for variable: AVFORMAT_LIBRARY
AVFORMAT_LIBRARY-ADVANCED:INTERNAL=1
//Advanced flag for variable: AVUTIL_FOUND
AVUTIL_FOUND-ADVANCED:INTERNAL=1
//Advanced flag for variable: AVUTIL_INCLUDE_DIR
AVUTIL_INCLUDE_DIR-ADVANCED:INTERNAL=1
//Advanced flag for variable: AVUTIL_LIBRARY
AVUTIL_LIBRARY-ADVANCED:INTERNAL=1
Atk_CFLAGS:INTERNAL=-I/usr/include/atk-1.0;-I/usr/include/glib-2.0;-I/usr/lib/glib-2.0/include
Atk_CFLAGS_I:INTERNAL=
Atk_CFLAGS_OTHER:INTERNAL=
Atk_FOUND:INTERNAL=1
Atk_INCLUDEDIR:INTERNAL=/usr/include
Atk_INCLUDE_DIRS:INTERNAL=/usr/include/atk-1.0;/usr/include/glib-2.0;/usr/lib/glib-2.0/include
Atk_LDFLAGS:INTERNAL=-latk-1.0;-lgobject-2.0;-lglib-2.0
Atk_LDFLAGS_OTHER:INTERNAL=
Atk_LIBDIR:INTERNAL=/usr/lib
Atk_LIBRARIES:INTERNAL=atk-1.0;gobject-2.0;glib-2.0
Atk_LIBRARY_DIRS:INTERNAL=
Atk_LIBS:INTERNAL=
Atk_LIBS_L:INTERNAL=
Atk_LIBS_OTHER:INTERNAL=
Atk_LIBS_PATHS:INTERNAL=
Atk_PREFIX:INTERNAL=/usr
Atk_STATIC_CFLAGS:INTERNAL=-I/usr/include/atk-1.0;-I/usr/include/glib-2.0;-I/usr/lib/glib-2.0/include
Atk_STATIC_CFLAGS_I:INTERNAL=
Atk_STATIC_CFLAGS_OTHER:INTERNAL=
Atk_STATIC_INCLUDE_DIRS:INTERNAL=/usr/include/atk-1.0;/usr/include/glib-2.0;/usr/lib/glib-2.0/include
Atk_STATIC_LDFLAGS:INTERNAL=-latk-1.0;-lgobject-2.0;-lglib-2.0
Atk_STATIC_LDFLAGS_OTHER:INTERNAL=
Atk_STATIC_LIBDIR:INTERNAL=
Atk_STATIC_LIBRARIES:INTERNAL=atk-1.0;gobject-2.0;glib-2.0
Atk_STATIC_LIBRARY_DIRS:INTERNAL=
Atk_STATIC_LIBS:INTERNAL=
Atk_STATIC_LIBS_L:INTERNAL=
Atk_STATIC_LIBS_OTHER:INTERNAL=
Atk_STATIC_LIBS_PATHS:INTERNAL=
Atk_VERSION:INTERNAL=1.28.0
Atk_atk_INCLUDEDIR:INTERNAL=
Atk_atk_LIBDIR:INTERNAL=
Atk_atk_PREFIX:INTERNAL=
Atk_atk_VERSION:INTERNAL=
//Advanced flag for variable: Boost_INCLUDE_DIR
Boost_INCLUDE_DIR-ADVANCED:INTERNAL=1
//Advanced flag for variable: Boost_LIBRARY_DIRS
Boost_LIBRARY_DIRS-ADVANCED:INTERNAL=1
//The library version string for boost libraries
Boost_LIB_VERSION:INTERNAL=1_40
//Whether the Boost PYTHON library found
Boost_PYTHON_FOUND:INTERNAL=ON
//Advanced flag for variable: Boost_PYTHON_LIBRARY
Boost_PYTHON_LIBRARY-ADVANCED:INTERNAL=1
//Advanced flag for variable: Boost_PYTHON_LIBRARY_DEBUG
Boost_PYTHON_LIBRARY_DEBUG-ADVANCED:INTERNAL=1
//Advanced flag for variable: Boost_PYTHON_LIBRARY_RELEASE
Boost_PYTHON_LIBRARY_RELEASE-ADVANCED:INTERNAL=1
//The version number for boost libraries
Boost_VERSION:INTERNAL=104000
//Advanced flag for variable: CMAKE_AR
CMAKE_AR-ADVANCED:INTERNAL=1
//Advanced flag for variable: CMAKE_BACKWARDS_COMPATIBILITY
CMAKE_BACKWARDS_COMPATIBILITY-ADVANCED:INTERNAL=1
//Advanced flag for variable: CMAKE_BUILD_TOOL
CMAKE_BUILD_TOOL-ADVANCED:INTERNAL=1
//What is the target build tool cmake is generating for.
CMAKE_BUILD_TOOL:INTERNAL=/usr/bin/make
//This is the directory where this CMakeCahe.txt was created
CMAKE_CACHEFILE_DIR:INTERNAL=/home/d/vs/cmake/vegastrike
//Major version of cmake used to create the current loaded cache
CMAKE_CACHE_MAJOR_VERSION:INTERNAL=2
//Minor version of cmake used to create the current loaded cache
CMAKE_CACHE_MINOR_VERSION:INTERNAL=6
//Major version of cmake used to create the current loaded cache
CMAKE_CACHE_RELEASE_VERSION:INTERNAL=patch 4
//Advanced flag for variable: CMAKE_COLOR_MAKEFILE
CMAKE_COLOR_MAKEFILE-ADVANCED:INTERNAL=1
//Path to CMake executable.
CMAKE_COMMAND:INTERNAL=/usr/bin/cmake
//Path to cpack program executable.
CMAKE_CPACK_COMMAND:INTERNAL=/usr/bin/cpack
//Path to ctest program executable.
CMAKE_CTEST_COMMAND:INTERNAL=/usr/bin/ctest
//Advanced flag for variable: CMAKE_CXX_COMPILER
CMAKE_CXX_COMPILER-ADVANCED:INTERNAL=1
CMAKE_CXX_COMPILER_WORKS:INTERNAL=1
//Advanced flag for variable: CMAKE_CXX_FLAGS
CMAKE_CXX_FLAGS-ADVANCED:INTERNAL=1
//Advanced flag for variable: CMAKE_CXX_FLAGS_DEBUG
CMAKE_CXX_FLAGS_DEBUG-ADVANCED:INTERNAL=1
//Advanced flag for variable: CMAKE_CXX_FLAGS_MAINTAINER
CMAKE_CXX_FLAGS_MAINTAINER-ADVANCED:INTERNAL=1
//Advanced flag for variable: CMAKE_CXX_FLAGS_MINSIZEREL
CMAKE_CXX_FLAGS_MINSIZEREL-ADVANCED:INTERNAL=1
//Advanced flag for variable: CMAKE_CXX_FLAGS_PROFILER
CMAKE_CXX_FLAGS_PROFILER-ADVANCED:INTERNAL=1
//Advanced flag for variable: CMAKE_CXX_FLAGS_RELEASE
CMAKE_CXX_FLAGS_RELEASE-ADVANCED:INTERNAL=0
//Advanced flag for variable: CMAKE_CXX_FLAGS_RELWITHDEBINFO
CMAKE_CXX_FLAGS_RELWITHDEBINFO-ADVANCED:INTERNAL=1
//Advanced flag for variable: CMAKE_C_COMPILER
CMAKE_C_COMPILER-ADVANCED:INTERNAL=1
CMAKE_C_COMPILER_WORKS:INTERNAL=1
//Advanced flag for variable: CMAKE_C_FLAGS
CMAKE_C_FLAGS-ADVANCED:INTERNAL=1
//Advanced flag for variable: CMAKE_C_FLAGS_DEBUG
CMAKE_C_FLAGS_DEBUG-ADVANCED:INTERNAL=1
//Advanced flag for variable: CMAKE_C_FLAGS_MAINTAINER
CMAKE_C_FLAGS_MAINTAINER-ADVANCED:INTERNAL=1
//Advanced flag for variable: CMAKE_C_FLAGS_MINSIZEREL
CMAKE_C_FLAGS_MINSIZEREL-ADVANCED:INTERNAL=1
//Advanced flag for variable: CMAKE_C_FLAGS_PROFILER
CMAKE_C_FLAGS_PROFILER-ADVANCED:INTERNAL=1
//Advanced flag for variable: CMAKE_C_FLAGS_RELEASE
CMAKE_C_FLAGS_RELEASE-ADVANCED:INTERNAL=1
//Advanced flag for variable: CMAKE_C_FLAGS_RELWITHDEBINFO
CMAKE_C_FLAGS_RELWITHDEBINFO-ADVANCED:INTERNAL=1
//Result of TRY_COMPILE
CMAKE_DETERMINE_CXX_ABI_COMPILED:INTERNAL=TRUE
//Result of TRY_COMPILE
CMAKE_DETERMINE_C_ABI_COMPILED:INTERNAL=TRUE
//Path to cache edit program executable.
CMAKE_EDIT_COMMAND:INTERNAL=/usr/bin/ccmake
//Executable file format
CMAKE_EXECUTABLE_FORMAT:INTERNAL=ELF
//Advanced flag for variable: CMAKE_EXE_LINKER_FLAGS
CMAKE_EXE_LINKER_FLAGS-ADVANCED:INTERNAL=1
//Advanced flag for variable: CMAKE_EXE_LINKER_FLAGS_DEBUG
CMAKE_EXE_LINKER_FLAGS_DEBUG-ADVANCED:INTERNAL=1
//Advanced flag for variable: CMAKE_EXE_LINKER_FLAGS_MAINTAINER
CMAKE_EXE_LINKER_FLAGS_MAINTAINER-ADVANCED:INTERNAL=1
//Advanced flag for variable: CMAKE_EXE_LINKER_FLAGS_MINSIZEREL
CMAKE_EXE_LINKER_FLAGS_MINSIZEREL-ADVANCED:INTERNAL=1
//Advanced flag for variable: CMAKE_EXE_LINKER_FLAGS_PROFILER
CMAKE_EXE_LINKER_FLAGS_PROFILER-ADVANCED:INTERNAL=1
//Advanced flag for variable: CMAKE_EXE_LINKER_FLAGS_RELEASE
CMAKE_EXE_LINKER_FLAGS_RELEASE-ADVANCED:INTERNAL=1
//Advanced flag for variable: CMAKE_EXE_LINKER_FLAGS_RELWITHDEBINFO
CMAKE_EXE_LINKER_FLAGS_RELWITHDEBINFO-ADVANCED:INTERNAL=1
//Name of generator.
CMAKE_GENERATOR:INTERNAL=Unix Makefiles
//Have function connect
CMAKE_HAVE_CONNECT:INTERNAL=1
//Have function gethostbyname
CMAKE_HAVE_GETHOSTBYNAME:INTERNAL=1
//Have library pthreads
CMAKE_HAVE_PTHREADS_CREATE:INTERNAL=
//Have library pthread
CMAKE_HAVE_PTHREAD_CREATE:INTERNAL=1
//Have include CMAKE_HAVE_PTHREAD_H
CMAKE_HAVE_PTHREAD_H:INTERNAL=1
//Have function remove
CMAKE_HAVE_REMOVE:INTERNAL=1
//Have function shmat
CMAKE_HAVE_SHMAT:INTERNAL=1
//Start directory with the top level CMakeLists.txt file for this
// project
CMAKE_HOME_DIRECTORY:INTERNAL=/home/d/vs/repo/trunk/vegastrike
//Install .so files without execute permission.
CMAKE_INSTALL_SO_NO_EXE:INTERNAL=1
//Have library ICE
CMAKE_LIB_ICE_HAS_ICECONNECTIONNUMBER:INTERNAL=1
//Advanced flag for variable: CMAKE_LINKER
CMAKE_LINKER-ADVANCED:INTERNAL=1
//Advanced flag for variable: CMAKE_MAKE_PROGRAM
CMAKE_MAKE_PROGRAM-ADVANCED:INTERNAL=1
//Advanced flag for variable: CMAKE_MODULE_LINKER_FLAGS
CMAKE_MODULE_LINKER_FLAGS-ADVANCED:INTERNAL=1
//Advanced flag for variable: CMAKE_MODULE_LINKER_FLAGS_DEBUG
CMAKE_MODULE_LINKER_FLAGS_DEBUG-ADVANCED:INTERNAL=1
//Advanced flag for variable: CMAKE_MODULE_LINKER_FLAGS_MINSIZEREL
CMAKE_MODULE_LINKER_FLAGS_MINSIZEREL-ADVANCED:INTERNAL=1
//Advanced flag for variable: CMAKE_MODULE_LINKER_FLAGS_RELEASE
CMAKE_MODULE_LINKER_FLAGS_RELEASE-ADVANCED:INTERNAL=1
//Advanced flag for variable: CMAKE_MODULE_LINKER_FLAGS_RELWITHDEBINFO
CMAKE_MODULE_LINKER_FLAGS_RELWITHDEBINFO-ADVANCED:INTERNAL=1
//Advanced flag for variable: CMAKE_NM
CMAKE_NM-ADVANCED:INTERNAL=1
//number of local generators
CMAKE_NUMBER_OF_LOCAL_GENERATORS:INTERNAL=3
//Advanced flag for variable: CMAKE_OBJCOPY
CMAKE_OBJCOPY-ADVANCED:INTERNAL=1
//Advanced flag for variable: CMAKE_OBJDUMP
CMAKE_OBJDUMP-ADVANCED:INTERNAL=1
//Advanced flag for variable: CMAKE_RANLIB
CMAKE_RANLIB-ADVANCED:INTERNAL=1
//Path to CMake installation.
CMAKE_ROOT:INTERNAL=/usr/share/cmake-2.6
//Advanced flag for variable: CMAKE_SHARED_LINKER_FLAGS
CMAKE_SHARED_LINKER_FLAGS-ADVANCED:INTERNAL=1
//Advanced flag for variable: CMAKE_SHARED_LINKER_FLAGS_DEBUG
CMAKE_SHARED_LINKER_FLAGS_DEBUG-ADVANCED:INTERNAL=1
//Advanced flag for variable: CMAKE_SHARED_LINKER_FLAGS_MAINTAINER
CMAKE_SHARED_LINKER_FLAGS_MAINTAINER-ADVANCED:INTERNAL=1
//Advanced flag for variable: CMAKE_SHARED_LINKER_FLAGS_MINSIZEREL
CMAKE_SHARED_LINKER_FLAGS_MINSIZEREL-ADVANCED:INTERNAL=1
//Advanced flag for variable: CMAKE_SHARED_LINKER_FLAGS_RELEASE
CMAKE_SHARED_LINKER_FLAGS_RELEASE-ADVANCED:INTERNAL=1
//Advanced flag for variable: CMAKE_SHARED_LINKER_FLAGS_RELWITHDEBINFO
CMAKE_SHARED_LINKER_FLAGS_RELWITHDEBINFO-ADVANCED:INTERNAL=1
//Advanced flag for variable: CMAKE_SKIP_RPATH
CMAKE_SKIP_RPATH-ADVANCED:INTERNAL=1
//Advanced flag for variable: CMAKE_STRIP
CMAKE_STRIP-ADVANCED:INTERNAL=1
//uname command
CMAKE_UNAME:INTERNAL=/bin/uname
//Advanced flag for variable: CMAKE_USE_RELATIVE_PATHS
CMAKE_USE_RELATIVE_PATHS-ADVANCED:INTERNAL=1
//Advanced flag for variable: CMAKE_VERBOSE_MAKEFILE
CMAKE_VERBOSE_MAKEFILE-ADVANCED:INTERNAL=1
Cairo_CFLAGS:INTERNAL=-D_REENTRANT;-I/usr/include/cairo;-I/usr/include/pixman-1;-I/usr/include/freetype2;-I/usr/include/directfb;-I/usr/include/libpng12
Cairo_CFLAGS_I:INTERNAL=
Cairo_CFLAGS_OTHER:INTERNAL=-D_REENTRANT
Cairo_FOUND:INTERNAL=1
Cairo_INCLUDEDIR:INTERNAL=/usr/include
Cairo_INCLUDE_DIRS:INTERNAL=/usr/include/cairo;/usr/include/pixman-1;/usr/include/freetype2;/usr/include/directfb;/usr/include/libpng12
Cairo_LDFLAGS:INTERNAL=-lcairo
Cairo_LDFLAGS_OTHER:INTERNAL=
Cairo_LIBDIR:INTERNAL=/usr/lib
Cairo_LIBRARIES:INTERNAL=cairo
Cairo_LIBRARY_DIRS:INTERNAL=
Cairo_LIBS:INTERNAL=
Cairo_LIBS_L:INTERNAL=
Cairo_LIBS_OTHER:INTERNAL=
Cairo_LIBS_PATHS:INTERNAL=
Cairo_PREFIX:INTERNAL=/usr
Cairo_STATIC_CFLAGS:INTERNAL=-D_REENTRANT;-I/usr/include/cairo;-I/usr/include/pixman-1;-I/usr/include/freetype2;-I/usr/include/directfb;-I/usr/include/libpng12
Cairo_STATIC_CFLAGS_I:INTERNAL=
Cairo_STATIC_CFLAGS_OTHER:INTERNAL=-D_REENTRANT
Cairo_STATIC_INCLUDE_DIRS:INTERNAL=/usr/include/cairo;/usr/include/pixman-1;/usr/include/freetype2;/usr/include/directfb;/usr/include/libpng12
Cairo_STATIC_LDFLAGS:INTERNAL=-lcairo;-lpixman-1;-lfontconfig;-lexpat;-lfreetype;-ldirectfb;-lpng12;-lz;-lm;-lxcb-render-util;-lXrender;-lfusion;-ldirect;-ldl;-lxcb-render;-lX11;-lpthread;-lxcb;-lXau;-lXdmcp
Cairo_STATIC_LDFLAGS_OTHER:INTERNAL=
Cairo_STATIC_LIBDIR:INTERNAL=
Cairo_STATIC_LIBRARIES:INTERNAL=cairo;pixman-1;fontconfig;expat;freetype;directfb;png12;z;m;xcb-render-util;Xrender;fusion;direct;dl;xcb-render;X11;pthread;xcb;Xau;Xdmcp
Cairo_STATIC_LIBRARY_DIRS:INTERNAL=
Cairo_STATIC_LIBS:INTERNAL=
Cairo_STATIC_LIBS_L:INTERNAL=
Cairo_STATIC_LIBS_OTHER:INTERNAL=
Cairo_STATIC_LIBS_PATHS:INTERNAL=
Cairo_VERSION:INTERNAL=1.8.8
Cairo_cairo_INCLUDEDIR:INTERNAL=
Cairo_cairo_LIBDIR:INTERNAL=
Cairo_cairo_PREFIX:INTERNAL=
Cairo_cairo_VERSION:INTERNAL=
//Advanced flag for variable: DL_LIB
DL_LIB-ADVANCED:INTERNAL=1
//Advanced flag for variable: EXPAT_INCLUDE_DIR
EXPAT_INCLUDE_DIR-ADVANCED:INTERNAL=1
//Advanced flag for variable: EXPAT_LIBRARY
EXPAT_LIBRARY-ADVANCED:INTERNAL=1
//Advanced flag for variable: FFMPEG_DEFINITIONS
FFMPEG_DEFINITIONS-ADVANCED:INTERNAL=1
//Advanced flag for variable: FFMPEG_INCLUDE_DIRS
FFMPEG_INCLUDE_DIRS-ADVANCED:INTERNAL=1
//Advanced flag for variable: FFMPEG_LIBRARIES
FFMPEG_LIBRARIES-ADVANCED:INTERNAL=1
//Details about finding EXPAT
FIND_PACKAGE_MESSAGE_DETAILS_EXPAT:INTERNAL=[/usr/lib/libexpat.so][/usr/include]
//Details about finding JPEG
FIND_PACKAGE_MESSAGE_DETAILS_JPEG:INTERNAL=[/usr/lib/libjpeg.so][/usr/include]
//Details about finding PythonLibs
FIND_PACKAGE_MESSAGE_DETAILS_PythonLibs:INTERNAL=[/usr/lib/python2.6/config/libpython2.6.so][/usr/include/python2.6]
//Details about finding Threads
FIND_PACKAGE_MESSAGE_DETAILS_Threads:INTERNAL=[TRUE]
//Details about finding X11
FIND_PACKAGE_MESSAGE_DETAILS_X11:INTERNAL=[/usr/lib/libX11.so][/usr/include;/usr/include;/usr/include;/usr/include;/usr/include;/usr/include;/usr/include;/usr/include;/usr/include;/usr/include;/usr/include;/usr/include;/usr/include;/usr/include;/usr/include;/usr/include;/usr/include]
//Details about finding ZLIB
FIND_PACKAGE_MESSAGE_DETAILS_ZLIB:INTERNAL=[/usr/lib/libz.so][/usr/include]
//Advanced flag for variable: GLUT_INCLUDE_DIR
GLUT_INCLUDE_DIR-ADVANCED:INTERNAL=1
//Advanced flag for variable: GLUT_Xi_LIBRARY
GLUT_Xi_LIBRARY-ADVANCED:INTERNAL=1
//Advanced flag for variable: GLUT_Xmu_LIBRARY
GLUT_Xmu_LIBRARY-ADVANCED:INTERNAL=1
//Advanced flag for variable: GLUT_glut_LIBRARY
GLUT_glut_LIBRARY-ADVANCED:INTERNAL=1
//Advanced flag for variable: GTK2_ATK_INCLUDE_DIR
GTK2_ATK_INCLUDE_DIR-ADVANCED:INTERNAL=1
//Advanced flag for variable: GTK2_ATK_LIBRARY
GTK2_ATK_LIBRARY-ADVANCED:INTERNAL=1
//Advanced flag for variable: GTK2_CAIRO_INCLUDE_DIR
GTK2_CAIRO_INCLUDE_DIR-ADVANCED:INTERNAL=1
//Advanced flag for variable: GTK2_CAIRO_LIBRARY
GTK2_CAIRO_LIBRARY-ADVANCED:INTERNAL=1
//Advanced flag for variable: GTK2_GDK_INCLUDE_DIR
GTK2_GDK_INCLUDE_DIR-ADVANCED:INTERNAL=1
//Advanced flag for variable: GTK2_GDK_LIBRARY
GTK2_GDK_LIBRARY-ADVANCED:INTERNAL=1
//Advanced flag for variable: GTK2_GDK_PIXBUF_LIBRARY
GTK2_GDK_PIXBUF_LIBRARY-ADVANCED:INTERNAL=1
//Advanced flag for variable: GTK2_GLIBCONFIG_INCLUDE_DIR
GTK2_GLIBCONFIG_INCLUDE_DIR-ADVANCED:INTERNAL=1
//Advanced flag for variable: GTK2_GLIB_INCLUDE_DIR
GTK2_GLIB_INCLUDE_DIR-ADVANCED:INTERNAL=1
//Advanced flag for variable: GTK2_GLIB_LIBRARY
GTK2_GLIB_LIBRARY-ADVANCED:INTERNAL=1
//Advanced flag for variable: GTK2_GMODULE_LIBRARY
GTK2_GMODULE_LIBRARY-ADVANCED:INTERNAL=1
//Advanced flag for variable: GTK2_GOBJECT_LIBRARY
GTK2_GOBJECT_LIBRARY-ADVANCED:INTERNAL=1
//Advanced flag for variable: GTK2_GTHREAD_LIBRARY
GTK2_GTHREAD_LIBRARY-ADVANCED:INTERNAL=1
//Advanced flag for variable: GTK2_GTKGL_INCLUDE_DIR
GTK2_GTKGL_INCLUDE_DIR-ADVANCED:INTERNAL=1
//Advanced flag for variable: GTK2_GTKGL_LIBRARY
GTK2_GTKGL_LIBRARY-ADVANCED:INTERNAL=1
//Advanced flag for variable: GTK2_GTK_INCLUDE_DIR
GTK2_GTK_INCLUDE_DIR-ADVANCED:INTERNAL=1
//Advanced flag for variable: GTK2_GTK_LIBRARY
GTK2_GTK_LIBRARY-ADVANCED:INTERNAL=1
//Advanced flag for variable: GTK2_PANGO_INCLUDE_DIR
GTK2_PANGO_INCLUDE_DIR-ADVANCED:INTERNAL=1
//Advanced flag for variable: GTK2_PANGO_LIBRARY
GTK2_PANGO_LIBRARY-ADVANCED:INTERNAL=1
//Advanced flag for variable: HAVE_AVCODEC_H
HAVE_AVCODEC_H-ADVANCED:INTERNAL=1
//Advanced flag for variable: HAVE_AVFORMAT_H
HAVE_AVFORMAT_H-ADVANCED:INTERNAL=1
//Advanced flag for variable: HAVE_AVIO_H
HAVE_AVIO_H-ADVANCED:INTERNAL=1
//Advanced flag for variable: HAVE_FFMPEG_SWSCALE_H
HAVE_FFMPEG_SWSCALE_H-ADVANCED:INTERNAL=1
//Have function finite
HAVE_FINITE:INTERNAL=1
//Have include float.h
HAVE_FLOAT_H:INTERNAL=1
//Have function gettimeofday
HAVE_GETTIMEOFDAY:INTERNAL=1
//Have symbol GLX_ARB_get_proc_address
HAVE_GLXGETPROCADDRESSARB:INTERNAL=1
//Have include inttypes.h
HAVE_INTTYPES_H:INTERNAL=1
//Have function isnan
HAVE_ISNAN:INTERNAL=1
//Have function lstat
HAVE_LSTAT:INTERNAL=1
//Have include math.h
HAVE_MATH_H:INTERNAL=1
//Have include sys/stat.h
HAVE_STAT_H:INTERNAL=1
//Have include tr1/unordered_map
HAVE_TR1_UNORDERED_MAP:INTERNAL=1
//Have include wchar.h
HAVE_WCHAR_H:INTERNAL=1
//Have include wctype.h
HAVE_WCTYPE_H:INTERNAL=1
//Have include zlib.h
HAVE_ZLIB_H:INTERNAL=1
//Advanced flag for variable: JPEG_INCLUDE_DIR
JPEG_INCLUDE_DIR-ADVANCED:INTERNAL=1
//Advanced flag for variable: JPEG_LIBRARY
JPEG_LIBRARY-ADVANCED:INTERNAL=1
LIBPNG_CFLAGS:INTERNAL=-I/usr/include/libpng12
LIBPNG_CFLAGS_I:INTERNAL=
LIBPNG_CFLAGS_OTHER:INTERNAL=
LIBPNG_FOUND:INTERNAL=1
LIBPNG_INCLUDEDIR:INTERNAL=/usr/include/libpng12
LIBPNG_INCLUDE_DIRS:INTERNAL=/usr/include/libpng12
LIBPNG_LDFLAGS:INTERNAL=-lpng12
LIBPNG_LDFLAGS_OTHER:INTERNAL=
LIBPNG_LIBDIR:INTERNAL=/usr/lib
LIBPNG_LIBRARIES:INTERNAL=png12
LIBPNG_LIBRARY_DIRS:INTERNAL=
LIBPNG_LIBS:INTERNAL=
LIBPNG_LIBS_L:INTERNAL=
LIBPNG_LIBS_OTHER:INTERNAL=
LIBPNG_LIBS_PATHS:INTERNAL=
LIBPNG_PREFIX:INTERNAL=/usr
LIBPNG_STATIC_CFLAGS:INTERNAL=-I/usr/include/libpng12
LIBPNG_STATIC_CFLAGS_I:INTERNAL=
LIBPNG_STATIC_CFLAGS_OTHER:INTERNAL=
LIBPNG_STATIC_INCLUDE_DIRS:INTERNAL=/usr/include/libpng12
LIBPNG_STATIC_LDFLAGS:INTERNAL=-lpng12;-lz;-lm
LIBPNG_STATIC_LDFLAGS_OTHER:INTERNAL=
LIBPNG_STATIC_LIBDIR:INTERNAL=
LIBPNG_STATIC_LIBRARIES:INTERNAL=png12;z;m
LIBPNG_STATIC_LIBRARY_DIRS:INTERNAL=
LIBPNG_STATIC_LIBS:INTERNAL=
LIBPNG_STATIC_LIBS_L:INTERNAL=
LIBPNG_STATIC_LIBS_OTHER:INTERNAL=
LIBPNG_STATIC_LIBS_PATHS:INTERNAL=
LIBPNG_VERSION:INTERNAL=1.2.37
LIBPNG_libpng_INCLUDEDIR:INTERNAL=
LIBPNG_libpng_LIBDIR:INTERNAL=
LIBPNG_libpng_PREFIX:INTERNAL=
LIBPNG_libpng_VERSION:INTERNAL=
//Advanced flag for variable: LIBRARY_OUTPUT_PATH
LIBRARY_OUTPUT_PATH-ADVANCED:INTERNAL=1
//Advanced flag for variable: MATH_INCLUDE_DIRS
MATH_INCLUDE_DIRS-ADVANCED:INTERNAL=1
//Advanced flag for variable: MATH_LIBRARIES
MATH_LIBRARIES-ADVANCED:INTERNAL=1
//Advanced flag for variable: OPENAL_INCLUDE_DIR
OPENAL_INCLUDE_DIR-ADVANCED:INTERNAL=1
//Advanced flag for variable: OPENAL_LIBRARY
OPENAL_LIBRARY-ADVANCED:INTERNAL=1
//Advanced flag for variable: OPENGL_INCLUDE_DIR
OPENGL_INCLUDE_DIR-ADVANCED:INTERNAL=1
//Advanced flag for variable: OPENGL_gl_LIBRARY
OPENGL_gl_LIBRARY-ADVANCED:INTERNAL=1
//Advanced flag for variable: OPENGL_glu_LIBRARY
OPENGL_glu_LIBRARY-ADVANCED:INTERNAL=1
//Advanced flag for variable: OPENGL_xmesa_INCLUDE_DIR
OPENGL_xmesa_INCLUDE_DIR-ADVANCED:INTERNAL=1
//Advanced flag for variable: PKG_CONFIG_EXECUTABLE
PKG_CONFIG_EXECUTABLE-ADVANCED:INTERNAL=1
//Advanced flag for variable: PNG_INCLUDE_DIRS
PNG_INCLUDE_DIRS-ADVANCED:INTERNAL=1
//Advanced flag for variable: PNG_LIBRARIES
PNG_LIBRARIES-ADVANCED:INTERNAL=1
//Advanced flag for variable: PYTHON_INCLUDE_PATH
PYTHON_INCLUDE_PATH-ADVANCED:INTERNAL=1
//Advanced flag for variable: PYTHON_LIBRARY
PYTHON_LIBRARY-ADVANCED:INTERNAL=1
Pango_CFLAGS:INTERNAL=-I/usr/include/pango-1.0;-I/usr/include/glib-2.0;-I/usr/lib/glib-2.0/include
Pango_CFLAGS_I:INTERNAL=
Pango_CFLAGS_OTHER:INTERNAL=
Pango_FOUND:INTERNAL=1
Pango_INCLUDEDIR:INTERNAL=/usr/include
Pango_INCLUDE_DIRS:INTERNAL=/usr/include/pango-1.0;/usr/include/glib-2.0;/usr/lib/glib-2.0/include
Pango_LDFLAGS:INTERNAL=-lpango-1.0;-lgobject-2.0;-lgmodule-2.0;-lglib-2.0
Pango_LDFLAGS_OTHER:INTERNAL=
Pango_LIBDIR:INTERNAL=/usr/lib
Pango_LIBRARIES:INTERNAL=pango-1.0;gobject-2.0;gmodule-2.0;glib-2.0
Pango_LIBRARY_DIRS:INTERNAL=
Pango_LIBS:INTERNAL=
Pango_LIBS_L:INTERNAL=
Pango_LIBS_OTHER:INTERNAL=
Pango_LIBS_PATHS:INTERNAL=
Pango_PREFIX:INTERNAL=/usr
Pango_STATIC_CFLAGS:INTERNAL=-I/usr/include/pango-1.0;-I/usr/include/glib-2.0;-I/usr/lib/glib-2.0/include
Pango_STATIC_CFLAGS_I:INTERNAL=
Pango_STATIC_CFLAGS_OTHER:INTERNAL=
Pango_STATIC_INCLUDE_DIRS:INTERNAL=/usr/include/pango-1.0;/usr/include/glib-2.0;/usr/lib/glib-2.0/include
Pango_STATIC_LDFLAGS:INTERNAL=-lpango-1.0;-lgobject-2.0;-lgmodule-2.0;-ldl;-lglib-2.0
Pango_STATIC_LDFLAGS_OTHER:INTERNAL=
Pango_STATIC_LIBDIR:INTERNAL=
Pango_STATIC_LIBRARIES:INTERNAL=pango-1.0;gobject-2.0;gmodule-2.0;dl;glib-2.0
Pango_STATIC_LIBRARY_DIRS:INTERNAL=
Pango_STATIC_LIBS:INTERNAL=
Pango_STATIC_LIBS_L:INTERNAL=
Pango_STATIC_LIBS_OTHER:INTERNAL=
Pango_STATIC_LIBS_PATHS:INTERNAL=
Pango_VERSION:INTERNAL=1.26.0
Pango_pango_INCLUDEDIR:INTERNAL=
Pango_pango_LIBDIR:INTERNAL=
Pango_pango_PREFIX:INTERNAL=
Pango_pango_VERSION:INTERNAL=
//Advanced flag for variable: SDLMAIN_LIBRARY
SDLMAIN_LIBRARY-ADVANCED:INTERNAL=1
//Advanced flag for variable: SDL_INCLUDE_DIR
SDL_INCLUDE_DIR-ADVANCED:INTERNAL=1
//Advanced flag for variable: SDL_LIBRARY
SDL_LIBRARY-ADVANCED:INTERNAL=1
SDL_LIBRARY_TEMP:INTERNAL=/usr/lib/libSDLmain.a;/usr/lib/libSDL.so;-lpthread
//Advanced flag for variable: SWSCALE_INCLUDE_DIR
SWSCALE_INCLUDE_DIR-ADVANCED:INTERNAL=1
//Advanced flag for variable: SWSCALE_LIBRARY
SWSCALE_LIBRARY-ADVANCED:INTERNAL=1
//Advanced flag for variable: UTIL_LIB
UTIL_LIB-ADVANCED:INTERNAL=1
//Advanced flag for variable: X11_ICE_INCLUDE_PATH
X11_ICE_INCLUDE_PATH-ADVANCED:INTERNAL=1
//Advanced flag for variable: X11_ICE_LIB
X11_ICE_LIB-ADVANCED:INTERNAL=1
//Have library /usr/lib/libX11.so;/usr/lib/libXext.so
X11_LIB_X11_SOLO:INTERNAL=1
//Advanced flag for variable: X11_SM_LIB
X11_SM_LIB-ADVANCED:INTERNAL=1
//Advanced flag for variable: X11_X11_INCLUDE_PATH
X11_X11_INCLUDE_PATH-ADVANCED:INTERNAL=1
//Advanced flag for variable: X11_X11_LIB
X11_X11_LIB-ADVANCED:INTERNAL=1
//Advanced flag for variable: X11_XShm_INCLUDE_PATH
X11_XShm_INCLUDE_PATH-ADVANCED:INTERNAL=1
//Advanced flag for variable: X11_XTest_INCLUDE_PATH
X11_XTest_INCLUDE_PATH-ADVANCED:INTERNAL=1
//Advanced flag for variable: X11_XTest_LIB
X11_XTest_LIB-ADVANCED:INTERNAL=1
//Advanced flag for variable: X11_Xaccessrules_INCLUDE_PATH
X11_Xaccessrules_INCLUDE_PATH-ADVANCED:INTERNAL=1
//Advanced flag for variable: X11_Xaccessstr_INCLUDE_PATH
X11_Xaccessstr_INCLUDE_PATH-ADVANCED:INTERNAL=1
//Advanced flag for variable: X11_Xau_INCLUDE_PATH
X11_Xau_INCLUDE_PATH-ADVANCED:INTERNAL=1
//Advanced flag for variable: X11_Xau_LIB
X11_Xau_LIB-ADVANCED:INTERNAL=1
//Advanced flag for variable: X11_Xcomposite_INCLUDE_PATH
X11_Xcomposite_INCLUDE_PATH-ADVANCED:INTERNAL=1
//Advanced flag for variable: X11_Xcomposite_LIB
X11_Xcomposite_LIB-ADVANCED:INTERNAL=1
//Advanced flag for variable: X11_Xcursor_INCLUDE_PATH
X11_Xcursor_INCLUDE_PATH-ADVANCED:INTERNAL=1
//Advanced flag for variable: X11_Xcursor_LIB
X11_Xcursor_LIB-ADVANCED:INTERNAL=1
//Advanced flag for variable: X11_Xdamage_INCLUDE_PATH
X11_Xdamage_INCLUDE_PATH-ADVANCED:INTERNAL=1
//Advanced flag for variable: X11_Xdamage_LIB
X11_Xdamage_LIB-ADVANCED:INTERNAL=1
//Advanced flag for variable: X11_Xdmcp_INCLUDE_PATH
X11_Xdmcp_INCLUDE_PATH-ADVANCED:INTERNAL=1
//Advanced flag for variable: X11_Xdmcp_LIB
X11_Xdmcp_LIB-ADVANCED:INTERNAL=1
//Advanced flag for variable: X11_Xext_LIB
X11_Xext_LIB-ADVANCED:INTERNAL=1
//Advanced flag for variable: X11_Xfixes_INCLUDE_PATH
X11_Xfixes_INCLUDE_PATH-ADVANCED:INTERNAL=1
//Advanced flag for variable: X11_Xfixes_LIB
X11_Xfixes_LIB-ADVANCED:INTERNAL=1
//Advanced flag for variable: X11_Xft_INCLUDE_PATH
X11_Xft_INCLUDE_PATH-ADVANCED:INTERNAL=1
//Advanced flag for variable: X11_Xft_LIB
X11_Xft_LIB-ADVANCED:INTERNAL=1
//Advanced flag for variable: X11_Xinerama_INCLUDE_PATH
X11_Xinerama_INCLUDE_PATH-ADVANCED:INTERNAL=1
//Advanced flag for variable: X11_Xinerama_LIB
X11_Xinerama_LIB-ADVANCED:INTERNAL=1
//Advanced flag for variable: X11_Xinput_INCLUDE_PATH
X11_Xinput_INCLUDE_PATH-ADVANCED:INTERNAL=1
//Advanced flag for variable: X11_Xinput_LIB
X11_Xinput_LIB-ADVANCED:INTERNAL=1
//Advanced flag for variable: X11_Xkb_INCLUDE_PATH
X11_Xkb_INCLUDE_PATH-ADVANCED:INTERNAL=1
//Advanced flag for variable: X11_Xkblib_INCLUDE_PATH
X11_Xkblib_INCLUDE_PATH-ADVANCED:INTERNAL=1
//Advanced flag for variable: X11_Xlib_INCLUDE_PATH
X11_Xlib_INCLUDE_PATH-ADVANCED:INTERNAL=1
//Advanced flag for variable: X11_Xpm_INCLUDE_PATH
X11_Xpm_INCLUDE_PATH-ADVANCED:INTERNAL=1
//Advanced flag for variable: X11_Xpm_LIB
X11_Xpm_LIB-ADVANCED:INTERNAL=1
//Advanced flag for variable: X11_Xrandr_INCLUDE_PATH
X11_Xrandr_INCLUDE_PATH-ADVANCED:INTERNAL=1
//Advanced flag for variable: X11_Xrandr_LIB
X11_Xrandr_LIB-ADVANCED:INTERNAL=1
//Advanced flag for variable: X11_Xrender_INCLUDE_PATH
X11_Xrender_INCLUDE_PATH-ADVANCED:INTERNAL=1
//Advanced flag for variable: X11_Xrender_LIB
X11_Xrender_LIB-ADVANCED:INTERNAL=1
//Advanced flag for variable: X11_Xscreensaver_INCLUDE_PATH
X11_Xscreensaver_INCLUDE_PATH-ADVANCED:INTERNAL=1
//Advanced flag for variable: X11_Xscreensaver_LIB
X11_Xscreensaver_LIB-ADVANCED:INTERNAL=1
//Advanced flag for variable: X11_Xshape_INCLUDE_PATH
X11_Xshape_INCLUDE_PATH-ADVANCED:INTERNAL=1
//Advanced flag for variable: X11_Xt_INCLUDE_PATH
X11_Xt_INCLUDE_PATH-ADVANCED:INTERNAL=1
//Advanced flag for variable: X11_Xt_LIB
X11_Xt_LIB-ADVANCED:INTERNAL=1
//Advanced flag for variable: X11_Xutil_INCLUDE_PATH
X11_Xutil_INCLUDE_PATH-ADVANCED:INTERNAL=1
//Advanced flag for variable: X11_Xv_INCLUDE_PATH
X11_Xv_INCLUDE_PATH-ADVANCED:INTERNAL=1
//Advanced flag for variable: X11_Xv_LIB
X11_Xv_LIB-ADVANCED:INTERNAL=1
//Advanced flag for variable: X11_Xxf86misc_LIB
X11_Xxf86misc_LIB-ADVANCED:INTERNAL=1
//Advanced flag for variable: X11_dpms_INCLUDE_PATH
X11_dpms_INCLUDE_PATH-ADVANCED:INTERNAL=1
//Advanced flag for variable: X11_xf86misc_INCLUDE_PATH
X11_xf86misc_INCLUDE_PATH-ADVANCED:INTERNAL=1
//Advanced flag for variable: X11_xf86vmode_INCLUDE_PATH
X11_xf86vmode_INCLUDE_PATH-ADVANCED:INTERNAL=1
//Advanced flag for variable: ZLIB_INCLUDE_DIR
ZLIB_INCLUDE_DIR-ADVANCED:INTERNAL=1
//Advanced flag for variable: ZLIB_LIBRARY
ZLIB_LIBRARY-ADVANCED:INTERNAL=1
__pkg_config_checked_Atk:INTERNAL=1
__pkg_config_checked_Cairo:INTERNAL=1
__pkg_config_checked_LIBPNG:INTERNAL=1
__pkg_config_checked_Pango:INTERNAL=1
__pkg_config_checked_avformat1:INTERNAL=1
__pkg_config_checked_avutil1:INTERNAL=1
__pkg_config_checked_ffmpeg1:INTERNAL=1
__pkg_config_checked_gdk2.0:INTERNAL=1
__pkg_config_checked_glib2.0:INTERNAL=1
__pkg_config_checked_gmod2.0:INTERNAL=1
__pkg_config_checked_gtk2.0:INTERNAL=1
__pkg_config_checked_swscale1:INTERNAL=1
avformat1_CFLAGS:INTERNAL=
avformat1_CFLAGS_I:INTERNAL=
avformat1_CFLAGS_OTHER:INTERNAL=
avformat1_FOUND:INTERNAL=1
avformat1_INCLUDEDIR:INTERNAL=/usr/include
avformat1_INCLUDE_DIRS:INTERNAL=
avformat1_LDFLAGS:INTERNAL=-lavformat
avformat1_LDFLAGS_OTHER:INTERNAL=
avformat1_LIBDIR:INTERNAL=/usr/lib
avformat1_LIBRARIES:INTERNAL=avformat
avformat1_LIBRARY_DIRS:INTERNAL=
avformat1_LIBS:INTERNAL=
avformat1_LIBS_L:INTERNAL=
avformat1_LIBS_OTHER:INTERNAL=
avformat1_LIBS_PATHS:INTERNAL=
avformat1_PREFIX:INTERNAL=/usr
avformat1_STATIC_CFLAGS:INTERNAL=
avformat1_STATIC_CFLAGS_I:INTERNAL=
avformat1_STATIC_CFLAGS_OTHER:INTERNAL=
avformat1_STATIC_INCLUDE_DIRS:INTERNAL=
avformat1_STATIC_LDFLAGS:INTERNAL=-pthread;-lavformat;-lavcodec;-lz;-lbz2;-lgsm;-lschroedinger-1.0;-lpthread;-loil-0.3;-lm;-lrt;-lspeex;-ltheora;-lvorbisenc;-lvorbis;-logg;-ldc1394;-lraw1394;-ldl;-lX11;-lXext;-lasound;-lavutil
avformat1_STATIC_LDFLAGS_OTHER:INTERNAL=-pthread
avformat1_STATIC_LIBDIR:INTERNAL=
avformat1_STATIC_LIBRARIES:INTERNAL=avformat;avcodec;z;bz2;gsm;schroedinger-1.0;pthread;oil-0.3;m;rt;speex;theora;vorbisenc;vorbis;ogg;dc1394;raw1394;dl;X11;Xext;asound;avutil
avformat1_STATIC_LIBRARY_DIRS:INTERNAL=
avformat1_STATIC_LIBS:INTERNAL=
avformat1_STATIC_LIBS_L:INTERNAL=
avformat1_STATIC_LIBS_OTHER:INTERNAL=
avformat1_STATIC_LIBS_PATHS:INTERNAL=
avformat1_VERSION:INTERNAL=52.31.0
avformat1_libavformat_INCLUDEDIR:INTERNAL=
avformat1_libavformat_LIBDIR:INTERNAL=
avformat1_libavformat_PREFIX:INTERNAL=
avformat1_libavformat_VERSION:INTERNAL=
avutil1_CFLAGS:INTERNAL=
avutil1_CFLAGS_I:INTERNAL=
avutil1_CFLAGS_OTHER:INTERNAL=
avutil1_FOUND:INTERNAL=1
avutil1_INCLUDEDIR:INTERNAL=/usr/include
avutil1_INCLUDE_DIRS:INTERNAL=
avutil1_LDFLAGS:INTERNAL=-lavutil
avutil1_LDFLAGS_OTHER:INTERNAL=
avutil1_LIBDIR:INTERNAL=/usr/lib
avutil1_LIBRARIES:INTERNAL=avutil
avutil1_LIBRARY_DIRS:INTERNAL=
avutil1_LIBS:INTERNAL=
avutil1_LIBS_L:INTERNAL=
avutil1_LIBS_OTHER:INTERNAL=
avutil1_LIBS_PATHS:INTERNAL=
avutil1_PREFIX:INTERNAL=/usr
avutil1_STATIC_CFLAGS:INTERNAL=
avutil1_STATIC_CFLAGS_I:INTERNAL=
avutil1_STATIC_CFLAGS_OTHER:INTERNAL=
avutil1_STATIC_INCLUDE_DIRS:INTERNAL=
avutil1_STATIC_LDFLAGS:INTERNAL=-lavutil
avutil1_STATIC_LDFLAGS_OTHER:INTERNAL=
avutil1_STATIC_LIBDIR:INTERNAL=
avutil1_STATIC_LIBRARIES:INTERNAL=avutil
avutil1_STATIC_LIBRARY_DIRS:INTERNAL=
avutil1_STATIC_LIBS:INTERNAL=
avutil1_STATIC_LIBS_L:INTERNAL=
avutil1_STATIC_LIBS_OTHER:INTERNAL=
avutil1_STATIC_LIBS_PATHS:INTERNAL=
avutil1_VERSION:INTERNAL=49.15.0
avutil1_libavutil_INCLUDEDIR:INTERNAL=
avutil1_libavutil_LIBDIR:INTERNAL=
avutil1_libavutil_PREFIX:INTERNAL=
avutil1_libavutil_VERSION:INTERNAL=
ffmpeg1_CFLAGS:INTERNAL=
ffmpeg1_CFLAGS_I:INTERNAL=
ffmpeg1_CFLAGS_OTHER:INTERNAL=
ffmpeg1_FOUND:INTERNAL=1
ffmpeg1_INCLUDEDIR:INTERNAL=/usr/include
ffmpeg1_INCLUDE_DIRS:INTERNAL=
ffmpeg1_LDFLAGS:INTERNAL=-lavcodec
ffmpeg1_LDFLAGS_OTHER:INTERNAL=
ffmpeg1_LIBDIR:INTERNAL=/usr/lib
ffmpeg1_LIBRARIES:INTERNAL=avcodec
ffmpeg1_LIBRARY_DIRS:INTERNAL=
ffmpeg1_LIBS:INTERNAL=
ffmpeg1_LIBS_L:INTERNAL=
ffmpeg1_LIBS_OTHER:INTERNAL=
ffmpeg1_LIBS_PATHS:INTERNAL=
ffmpeg1_PREFIX:INTERNAL=/usr
ffmpeg1_STATIC_CFLAGS:INTERNAL=
ffmpeg1_STATIC_CFLAGS_I:INTERNAL=
ffmpeg1_STATIC_CFLAGS_OTHER:INTERNAL=
ffmpeg1_STATIC_INCLUDE_DIRS:INTERNAL=
ffmpeg1_STATIC_LDFLAGS:INTERNAL=-pthread;-lavcodec;-lz;-lbz2;-lgsm;-lschroedinger-1.0;-lpthread;-loil-0.3;-lm;-lrt;-lspeex;-ltheora;-lvorbisenc;-lvorbis;-logg;-ldc1394;-lraw1394;-ldl;-lX11;-lXext;-lasound;-lavutil
ffmpeg1_STATIC_LDFLAGS_OTHER:INTERNAL=-pthread
ffmpeg1_STATIC_LIBDIR:INTERNAL=
ffmpeg1_STATIC_LIBRARIES:INTERNAL=avcodec;z;bz2;gsm;schroedinger-1.0;pthread;oil-0.3;m;rt;speex;theora;vorbisenc;vorbis;ogg;dc1394;raw1394;dl;X11;Xext;asound;avutil
ffmpeg1_STATIC_LIBRARY_DIRS:INTERNAL=
ffmpeg1_STATIC_LIBS:INTERNAL=
ffmpeg1_STATIC_LIBS_L:INTERNAL=
ffmpeg1_STATIC_LIBS_OTHER:INTERNAL=
ffmpeg1_STATIC_LIBS_PATHS:INTERNAL=
ffmpeg1_VERSION:INTERNAL=52.20.0
ffmpeg1_libavcodec_INCLUDEDIR:INTERNAL=
ffmpeg1_libavcodec_LIBDIR:INTERNAL=
ffmpeg1_libavcodec_PREFIX:INTERNAL=
ffmpeg1_libavcodec_VERSION:INTERNAL=
gdk2.0_CFLAGS:INTERNAL=-D_REENTRANT;-I/usr/include/gtk-2.0;-I/usr/lib/gtk-2.0/include;-I/usr/include/cairo;-I/usr/include/pango-1.0;-I/usr/include/pixman-1;-I/usr/include/freetype2;-I/usr/include/directfb;-I/usr/include/libpng12;-I/usr/include/glib-2.0;-I/usr/lib/glib-2.0/include
gdk2.0_CFLAGS_I:INTERNAL=
gdk2.0_CFLAGS_OTHER:INTERNAL=-D_REENTRANT
gdk2.0_FOUND:INTERNAL=1
gdk2.0_INCLUDEDIR:INTERNAL=/usr/include
gdk2.0_INCLUDE_DIRS:INTERNAL=/usr/include/gtk-2.0;/usr/lib/gtk-2.0/include;/usr/include/cairo;/usr/include/pango-1.0;/usr/include/pixman-1;/usr/include/freetype2;/usr/include/directfb;/usr/include/libpng12;/usr/include/glib-2.0;/usr/lib/glib-2.0/include
gdk2.0_LDFLAGS:INTERNAL=-lgdk-x11-2.0;-lgdk_pixbuf-2.0;-lm;-lpangocairo-1.0;-lgio-2.0;-lpango-1.0;-lcairo;-lgobject-2.0;-lgmodule-2.0;-lglib-2.0
gdk2.0_LDFLAGS_OTHER:INTERNAL=
gdk2.0_LIBDIR:INTERNAL=/usr/lib
gdk2.0_LIBRARIES:INTERNAL=gdk-x11-2.0;gdk_pixbuf-2.0;m;pangocairo-1.0;gio-2.0;pango-1.0;cairo;gobject-2.0;gmodule-2.0;glib-2.0
gdk2.0_LIBRARY_DIRS:INTERNAL=
gdk2.0_LIBS:INTERNAL=
gdk2.0_LIBS_L:INTERNAL=
gdk2.0_LIBS_OTHER:INTERNAL=
gdk2.0_LIBS_PATHS:INTERNAL=
gdk2.0_PREFIX:INTERNAL=/usr
gdk2.0_STATIC_CFLAGS:INTERNAL=-D_REENTRANT;-I/usr/include/gtk-2.0;-I/usr/lib/gtk-2.0/include;-I/usr/include/cairo;-I/usr/include/pango-1.0;-I/usr/include/pixman-1;-I/usr/include/freetype2;-I/usr/include/directfb;-I/usr/include/libpng12;-I/usr/include/glib-2.0;-I/usr/lib/glib-2.0/include
gdk2.0_STATIC_CFLAGS_I:INTERNAL=
gdk2.0_STATIC_CFLAGS_OTHER:INTERNAL=-D_REENTRANT
gdk2.0_STATIC_INCLUDE_DIRS:INTERNAL=/usr/include/gtk-2.0;/usr/lib/gtk-2.0/include;/usr/include/cairo;/usr/include/pango-1.0;/usr/include/pixman-1;/usr/include/freetype2;/usr/include/directfb;/usr/include/libpng12;/usr/include/glib-2.0;/usr/lib/glib-2.0/include
gdk2.0_STATIC_LDFLAGS:INTERNAL=-lgdk-x11-2.0;-lXinerama;-lXi;-lXrandr;-lXcursor;-lXcomposite;-lXdamage;-lgdk_pixbuf-2.0;-ltiff;-ljpeg;-ljasper;-lpangocairo-1.0;-lgio-2.0;-lXext;-lXfixes;-lpango-1.0;-lcairo;-lpixman-1;-lfontconfig;-lexpat;-lfreetype;-ldirectfb;-lpng12;-lz;-lm;-lxcb-render-util;-lXrender;-lfusion;-ldirect;-lxcb-render;-lX11;-lpthread;-lxcb;-lXau;-lXdmcp;-lgobject-2.0;-lgmodule-2.0;-ldl;-lglib-2.0
gdk2.0_STATIC_LDFLAGS_OTHER:INTERNAL=
gdk2.0_STATIC_LIBDIR:INTERNAL=
gdk2.0_STATIC_LIBRARIES:INTERNAL=gdk-x11-2.0;Xinerama;Xi;Xrandr;Xcursor;Xcomposite;Xdamage;gdk_pixbuf-2.0;tiff;jpeg;jasper;pangocairo-1.0;gio-2.0;Xext;Xfixes;pango-1.0;cairo;pixman-1;fontconfig;expat;freetype;directfb;png12;z;m;xcb-render-util;Xrender;fusion;direct;xcb-render;X11;pthread;xcb;Xau;Xdmcp;gobject-2.0;gmodule-2.0;dl;glib-2.0
gdk2.0_STATIC_LIBRARY_DIRS:INTERNAL=
gdk2.0_STATIC_LIBS:INTERNAL=
gdk2.0_STATIC_LIBS_L:INTERNAL=
gdk2.0_STATIC_LIBS_OTHER:INTERNAL=
gdk2.0_STATIC_LIBS_PATHS:INTERNAL=
gdk2.0_VERSION:INTERNAL=2.18.3
gdk2.0_gdk-2.0_INCLUDEDIR:INTERNAL=
gdk2.0_gdk-2.0_LIBDIR:INTERNAL=
gdk2.0_gdk-2.0_PREFIX:INTERNAL=
gdk2.0_gdk-2.0_VERSION:INTERNAL=
glib2.0_CFLAGS:INTERNAL=-I/usr/include/glib-2.0;-I/usr/lib/glib-2.0/include
glib2.0_CFLAGS_I:INTERNAL=
glib2.0_CFLAGS_OTHER:INTERNAL=
glib2.0_FOUND:INTERNAL=1
glib2.0_INCLUDEDIR:INTERNAL=/usr/include
glib2.0_INCLUDE_DIRS:INTERNAL=/usr/include/glib-2.0;/usr/lib/glib-2.0/include
glib2.0_LDFLAGS:INTERNAL=-lglib-2.0
glib2.0_LDFLAGS_OTHER:INTERNAL=
glib2.0_LIBDIR:INTERNAL=/usr/lib
glib2.0_LIBRARIES:INTERNAL=glib-2.0
glib2.0_LIBRARY_DIRS:INTERNAL=
glib2.0_LIBS:INTERNAL=
glib2.0_LIBS_L:INTERNAL=
glib2.0_LIBS_OTHER:INTERNAL=
glib2.0_LIBS_PATHS:INTERNAL=
glib2.0_PREFIX:INTERNAL=/usr
glib2.0_STATIC_CFLAGS:INTERNAL=-I/usr/include/glib-2.0;-I/usr/lib/glib-2.0/include
glib2.0_STATIC_CFLAGS_I:INTERNAL=
glib2.0_STATIC_CFLAGS_OTHER:INTERNAL=
glib2.0_STATIC_INCLUDE_DIRS:INTERNAL=/usr/include/glib-2.0;/usr/lib/glib-2.0/include
glib2.0_STATIC_LDFLAGS:INTERNAL=-lglib-2.0
glib2.0_STATIC_LDFLAGS_OTHER:INTERNAL=
glib2.0_STATIC_LIBDIR:INTERNAL=
glib2.0_STATIC_LIBRARIES:INTERNAL=glib-2.0
glib2.0_STATIC_LIBRARY_DIRS:INTERNAL=
glib2.0_STATIC_LIBS:INTERNAL=
glib2.0_STATIC_LIBS_L:INTERNAL=
glib2.0_STATIC_LIBS_OTHER:INTERNAL=
glib2.0_STATIC_LIBS_PATHS:INTERNAL=
glib2.0_VERSION:INTERNAL=2.22.3
glib2.0_glib-2.0_INCLUDEDIR:INTERNAL=
glib2.0_glib-2.0_LIBDIR:INTERNAL=
glib2.0_glib-2.0_PREFIX:INTERNAL=
glib2.0_glib-2.0_VERSION:INTERNAL=
gmod2.0_CFLAGS:INTERNAL=-I/usr/include/glib-2.0;-I/usr/lib/glib-2.0/include
gmod2.0_CFLAGS_I:INTERNAL=
gmod2.0_CFLAGS_OTHER:INTERNAL=
gmod2.0_FOUND:INTERNAL=1
gmod2.0_INCLUDEDIR:INTERNAL=/usr/include
gmod2.0_INCLUDE_DIRS:INTERNAL=/usr/include/glib-2.0;/usr/lib/glib-2.0/include
gmod2.0_LDFLAGS:INTERNAL=-Wl,--export-dynamic;-lgmodule-2.0;-lglib-2.0
gmod2.0_LDFLAGS_OTHER:INTERNAL=-Wl,--export-dynamic
gmod2.0_LIBDIR:INTERNAL=/usr/lib
gmod2.0_LIBRARIES:INTERNAL=gmodule-2.0;glib-2.0
gmod2.0_LIBRARY_DIRS:INTERNAL=
gmod2.0_LIBS:INTERNAL=
gmod2.0_LIBS_L:INTERNAL=
gmod2.0_LIBS_OTHER:INTERNAL=
gmod2.0_LIBS_PATHS:INTERNAL=
gmod2.0_PREFIX:INTERNAL=/usr
gmod2.0_STATIC_CFLAGS:INTERNAL=-I/usr/include/glib-2.0;-I/usr/lib/glib-2.0/include
gmod2.0_STATIC_CFLAGS_I:INTERNAL=
gmod2.0_STATIC_CFLAGS_OTHER:INTERNAL=
gmod2.0_STATIC_INCLUDE_DIRS:INTERNAL=/usr/include/glib-2.0;/usr/lib/glib-2.0/include
gmod2.0_STATIC_LDFLAGS:INTERNAL=-Wl,--export-dynamic;-lgmodule-2.0;-ldl;-lglib-2.0
gmod2.0_STATIC_LDFLAGS_OTHER:INTERNAL=-Wl,--export-dynamic
gmod2.0_STATIC_LIBDIR:INTERNAL=
gmod2.0_STATIC_LIBRARIES:INTERNAL=gmodule-2.0;dl;glib-2.0
gmod2.0_STATIC_LIBRARY_DIRS:INTERNAL=
gmod2.0_STATIC_LIBS:INTERNAL=
gmod2.0_STATIC_LIBS_L:INTERNAL=
gmod2.0_STATIC_LIBS_OTHER:INTERNAL=
gmod2.0_STATIC_LIBS_PATHS:INTERNAL=
gmod2.0_VERSION:INTERNAL=2.22.3
gmod2.0_gmodule-2.0_INCLUDEDIR:INTERNAL=
gmod2.0_gmodule-2.0_LIBDIR:INTERNAL=
gmod2.0_gmodule-2.0_PREFIX:INTERNAL=
gmod2.0_gmodule-2.0_VERSION:INTERNAL=
gtk2.0_CFLAGS:INTERNAL=-D_REENTRANT;-I/usr/include/gtk-2.0;-I/usr/lib/gtk-2.0/include;-I/usr/include/atk-1.0;-I/usr/include/cairo;-I/usr/include/pango-1.0;-I/usr/include/pixman-1;-I/usr/include/freetype2;-I/usr/include/directfb;-I/usr/include/libpng12;-I/usr/include/glib-2.0;-I/usr/lib/glib-2.0/include
gtk2.0_CFLAGS_I:INTERNAL=
gtk2.0_CFLAGS_OTHER:INTERNAL=-D_REENTRANT
gtk2.0_FOUND:INTERNAL=1
gtk2.0_INCLUDEDIR:INTERNAL=/usr/include
gtk2.0_INCLUDE_DIRS:INTERNAL=/usr/include/gtk-2.0;/usr/lib/gtk-2.0/include;/usr/include/atk-1.0;/usr/include/cairo;/usr/include/pango-1.0;/usr/include/pixman-1;/usr/include/freetype2;/usr/include/directfb;/usr/include/libpng12;/usr/include/glib-2.0;/usr/lib/glib-2.0/include
gtk2.0_LDFLAGS:INTERNAL=-lgtk-x11-2.0;-lgdk-x11-2.0;-latk-1.0;-lpangoft2-1.0;-lgdk_pixbuf-2.0;-lm;-lpangocairo-1.0;-lgio-2.0;-lcairo;-lpango-1.0;-lfreetype;-lfontconfig;-lgobject-2.0;-lgmodule-2.0;-lglib-2.0
gtk2.0_LDFLAGS_OTHER:INTERNAL=
gtk2.0_LIBDIR:INTERNAL=/usr/lib
gtk2.0_LIBRARIES:INTERNAL=gtk-x11-2.0;gdk-x11-2.0;atk-1.0;pangoft2-1.0;gdk_pixbuf-2.0;m;pangocairo-1.0;gio-2.0;cairo;pango-1.0;freetype;fontconfig;gobject-2.0;gmodule-2.0;glib-2.0
gtk2.0_LIBRARY_DIRS:INTERNAL=
gtk2.0_LIBS:INTERNAL=
gtk2.0_LIBS_L:INTERNAL=
gtk2.0_LIBS_OTHER:INTERNAL=
gtk2.0_LIBS_PATHS:INTERNAL=
gtk2.0_PREFIX:INTERNAL=/usr
gtk2.0_STATIC_CFLAGS:INTERNAL=-D_REENTRANT;-I/usr/include/gtk-2.0;-I/usr/lib/gtk-2.0/include;-I/usr/include/atk-1.0;-I/usr/include/cairo;-I/usr/include/pango-1.0;-I/usr/include/pixman-1;-I/usr/include/freetype2;-I/usr/include/directfb;-I/usr/include/libpng12;-I/usr/include/glib-2.0;-I/usr/lib/glib-2.0/include
gtk2.0_STATIC_CFLAGS_I:INTERNAL=
gtk2.0_STATIC_CFLAGS_OTHER:INTERNAL=-D_REENTRANT
gtk2.0_STATIC_INCLUDE_DIRS:INTERNAL=/usr/include/gtk-2.0;/usr/lib/gtk-2.0/include;/usr/include/atk-1.0;/usr/include/cairo;/usr/include/pango-1.0;/usr/include/pixman-1;/usr/include/freetype2;/usr/include/directfb;/usr/include/libpng12;/usr/include/glib-2.0;/usr/lib/glib-2.0/include
gtk2.0_STATIC_LDFLAGS:INTERNAL=-lgtk-x11-2.0;-lgdk-x11-2.0;-latk-1.0;-lpangoft2-1.0;-lXinerama;-lXi;-lXrandr;-lXcursor;-lXcomposite;-lXdamage;-lgdk_pixbuf-2.0;-ltiff;-ljpeg;-ljasper;-lpangocairo-1.0;-lgio-2.0;-lXext;-lXfixes;-lcairo;-lpixman-1;-ldirectfb;-lpng12;-lm;-lxcb-render-util;-lXrender;-lfusion;-ldirect;-lxcb-render;-lX11;-lpthread;-lxcb;-lXau;-lXdmcp;-lpango-1.0;-lfontconfig;-lexpat;-lfreetype;-lz;-lgobject-2.0;-lgmodule-2.0;-ldl;-lglib-2.0
gtk2.0_STATIC_LDFLAGS_OTHER:INTERNAL=
gtk2.0_STATIC_LIBDIR:INTERNAL=
gtk2.0_STATIC_LIBRARIES:INTERNAL=gtk-x11-2.0;gdk-x11-2.0;atk-1.0;pangoft2-1.0;Xinerama;Xi;Xrandr;Xcursor;Xcomposite;Xdamage;gdk_pixbuf-2.0;tiff;jpeg;jasper;pangocairo-1.0;gio-2.0;Xext;Xfixes;cairo;pixman-1;directfb;png12;m;xcb-render-util;Xrender;fusion;direct;xcb-render;X11;pthread;xcb;Xau;Xdmcp;pango-1.0;fontconfig;expat;freetype;z;gobject-2.0;gmodule-2.0;dl;glib-2.0
gtk2.0_STATIC_LIBRARY_DIRS:INTERNAL=
gtk2.0_STATIC_LIBS:INTERNAL=
gtk2.0_STATIC_LIBS_L:INTERNAL=
gtk2.0_STATIC_LIBS_OTHER:INTERNAL=
gtk2.0_STATIC_LIBS_PATHS:INTERNAL=
gtk2.0_VERSION:INTERNAL=2.18.3
gtk2.0_gtk+-2.0_INCLUDEDIR:INTERNAL=
gtk2.0_gtk+-2.0_LIBDIR:INTERNAL=
gtk2.0_gtk+-2.0_PREFIX:INTERNAL=
gtk2.0_gtk+-2.0_VERSION:INTERNAL=
//Advanced flag for variable: ogg_INCLUDE_DIR
ogg_INCLUDE_DIR-ADVANCED:INTERNAL=1
//Advanced flag for variable: ogg_LIBRARY
ogg_LIBRARY-ADVANCED:INTERNAL=1
swscale1_CFLAGS:INTERNAL=
swscale1_CFLAGS_I:INTERNAL=
swscale1_CFLAGS_OTHER:INTERNAL=
swscale1_FOUND:INTERNAL=1
swscale1_INCLUDEDIR:INTERNAL=/usr/include
swscale1_INCLUDE_DIRS:INTERNAL=
swscale1_LDFLAGS:INTERNAL=-lswscale
swscale1_LDFLAGS_OTHER:INTERNAL=
swscale1_LIBDIR:INTERNAL=/usr/lib
swscale1_LIBRARIES:INTERNAL=swscale
swscale1_LIBRARY_DIRS:INTERNAL=
swscale1_LIBS:INTERNAL=
swscale1_LIBS_L:INTERNAL=
swscale1_LIBS_OTHER:INTERNAL=
swscale1_LIBS_PATHS:INTERNAL=
swscale1_PREFIX:INTERNAL=/usr
swscale1_STATIC_CFLAGS:INTERNAL=
swscale1_STATIC_CFLAGS_I:INTERNAL=
swscale1_STATIC_CFLAGS_OTHER:INTERNAL=
swscale1_STATIC_INCLUDE_DIRS:INTERNAL=
swscale1_STATIC_LDFLAGS:INTERNAL=-lswscale;-lavutil
swscale1_STATIC_LDFLAGS_OTHER:INTERNAL=
swscale1_STATIC_LIBDIR:INTERNAL=
swscale1_STATIC_LIBRARIES:INTERNAL=swscale;avutil
swscale1_STATIC_LIBRARY_DIRS:INTERNAL=
swscale1_STATIC_LIBS:INTERNAL=
swscale1_STATIC_LIBS_L:INTERNAL=
swscale1_STATIC_LIBS_OTHER:INTERNAL=
swscale1_STATIC_LIBS_PATHS:INTERNAL=
swscale1_VERSION:INTERNAL=0.7.1
swscale1_libswscale_INCLUDEDIR:INTERNAL=
swscale1_libswscale_LIBDIR:INTERNAL=
swscale1_libswscale_PREFIX:INTERNAL=
swscale1_libswscale_VERSION:INTERNAL=
//Advanced flag for variable: vorbis_INCLUDE_DIR
vorbis_INCLUDE_DIR-ADVANCED:INTERNAL=1
//Advanced flag for variable: vorbis_LIBRARY
vorbis_LIBRARY-ADVANCED:INTERNAL=1
//Advanced flag for variable: vorbisfile_LIBRARY
vorbisfile_LIBRARY-ADVANCED:INTERNAL=1

EDIT:
Hmmmm....
Code: Select all
/usr/include/libavcodec$ ls
avcodec.h  opt.h  vdpau.h  xvmc.h

Code: Select all
/usr/include/libavformat$ ls
avformat.h  avio.h

Code: Select all
/usr/lib$ ls -al libav*
lrwxrwxrwx 1 root root      24 2009-11-26 18:54 libavahi-client.so.3 -> libavahi-client.so.3.2.5
-rw-r--r-- 1 root root   68480 2009-11-03 18:53 libavahi-client.so.3.2.5
lrwxrwxrwx 1 root root      24 2009-11-26 18:54 libavahi-common.so.3 -> libavahi-common.so.3.5.1
-rw-r--r-- 1 root root   51608 2009-11-03 18:53 libavahi-common.so.3.5.1
lrwxrwxrwx 1 root root      22 2009-11-26 18:54 libavahi-core.so.6 -> libavahi-core.so.6.0.1
-rw-r--r-- 1 root root  207560 2009-11-03 18:53 libavahi-core.so.6.0.1
lrwxrwxrwx 1 root root      22 2009-11-26 18:54 libavahi-glib.so.1 -> libavahi-glib.so.1.0.1
-rw-r--r-- 1 root root   14544 2009-11-03 18:53 libavahi-glib.so.1.0.1
lrwxrwxrwx 1 root root      25 2009-11-26 18:54 libavahi-gobject.so.0 -> libavahi-gobject.so.0.0.1
-rw-r--r-- 1 root root   48128 2009-11-03 18:53 libavahi-gobject.so.0.0.1
lrwxrwxrwx 1 root root      20 2009-11-26 18:54 libavahi-ui.so.0 -> libavahi-ui.so.0.1.1
-rw-r--r-- 1 root root   52552 2009-11-03 18:53 libavahi-ui.so.0.1.1
lrwxrwxrwx 1 root root      19 2009-11-01 16:57 libavc1394.so.0 -> libavc1394.so.0.3.0
-rw-r--r-- 1 root root   18552 2009-09-05 21:06 libavc1394.so.0.3.0
-rw-r--r-- 1 root root 7274778 2009-10-13 18:35 libavcodec.a
lrwxrwxrwx 1 root root      21 2010-02-28 18:36 libavcodec.so -> libavcodec.so.52.20.0
lrwxrwxrwx 1 root root      21 2009-11-01 20:10 libavcodec.so.52 -> libavcodec.so.52.20.0
-rw-r--r-- 1 root root 5489192 2009-10-13 18:35 libavcodec.so.52.20.0
lrwxrwxrwx 1 root root      21 2010-04-16 14:46 libavdevice.so.52 -> libavdevice.so.52.1.0
-rw-r--r-- 1 root root   41168 2009-10-13 18:35 libavdevice.so.52.1.0
lrwxrwxrwx 1 root root      20 2010-04-16 14:46 libavfilter.so.0 -> libavfilter.so.0.4.0
-rw-r--r-- 1 root root   18568 2009-10-13 18:35 libavfilter.so.0.4.0
-rw-r--r-- 1 root root 1305040 2009-10-13 18:35 libavformat.a
lrwxrwxrwx 1 root root      22 2010-03-01 07:22 libavformat.so -> libavformat.so.52.31.0
lrwxrwxrwx 1 root root      22 2009-11-01 20:10 libavformat.so.52 -> libavformat.so.52.31.0
-rw-r--r-- 1 root root  690704 2009-10-13 18:35 libavformat.so.52.31.0
-rw-r--r-- 1 root root   85068 2009-10-13 18:35 libavutil.a
lrwxrwxrwx 1 root root      20 2010-02-28 18:36 libavutil.so -> libavutil.so.49.15.0
lrwxrwxrwx 1 root root      20 2010-04-16 14:46 libavutil.so.49 -> libavutil.so.49.15.0
-rw-r--r-- 1 root root   47216 2009-10-13 18:35 libavutil.so.49.15.0

Code: Select all
/usr/include$ ls -al f*
-rw-r--r-- 1 root root  7474 2010-01-03 06:57 fcntl.h
-rw-r--r-- 1 root root 12807 2010-01-03 06:56 features.h
-rw-r--r-- 1 root root  4670 2010-01-03 06:57 fenv.h
-rw-r--r-- 1 root root  3329 2010-01-03 06:57 fmtmsg.h
-rw-r--r-- 1 root root  2530 2010-01-03 06:57 fnmatch.h
-rw-r--r-- 1 root root 17190 2009-10-12 09:13 form.h
-rw-r--r-- 1 root root  3163 2010-01-03 06:57 fpu_control.h
-rw-r--r-- 1 root root  3115 2010-01-03 06:57 fstab.h
-rw-r--r-- 1 root root  3890 2009-06-04 01:05 ft2build.h
-rw-r--r-- 1 root root  5290 2010-01-03 06:57 fts.h
-rw-r--r-- 1 root root  5360 2010-01-03 06:57 ftw.h

No ffmpeg in /usr/include.
User avatar
chuck_starchaser
Elite
Elite
 
Posts: 8014
Topics: 195
Joined: Thu Sep 04, 2003 9:03 pm
Location: Montreal

Re: Compile problem under cmake

Postby klauss » Fri Apr 16, 2010 4:15 pm

I know what the problem is. When I get home I'll try to commit a fix.

Basically, ffmpeg_init.h is trying to include from ffmpeg/<file>, and according to what CMakeCache says, it should be including from <file> plain and simply.

That is controlled through a few #defines, so cmake must be setting the wrong defines.
Oíd mortales, el grito sagrado...
Call me "Menes, lord of Cats"
Wing Commander Universe
User avatar
klauss
Elite
Elite
 
Posts: 7243
Topics: 55
Joined: Mon Apr 18, 2005 7:40 am
Location: LS87, Buenos Aires, República Argentina



Return to Compiling Problems [paste config.log]

Who is online

Users browsing this forum: No registered users and 1 guest

cron